program: Gaussian 09
title: 000231771
version: EM64L-G09RevD.01
frameworkgroup: C1[X(C15H12Br2O2)]
method: RPBEPBE
basis: SDD
operation: Freq
keyword: #p
keyword: freq=noraman
keyword: PBEPBE/SDD
title: #p freq=noraman PBEPBE/SDD
converged: YES YES NO NO
title: Mulliken charges:
elementType: Br Br O O C C C C C C C C C C C C C C C H H H H H H H H H H H H
charge: -0.005285 0.050527 -0.274230 -0.190874 -0.642416 -0.604880 0.588760 -0.393448 -0.306513 0.309533 -0.222909 -0.237767 -0.230857 0.394020 -0.397761 -0.313928 -0.195087 -0.210459 -0.242521 0.349458 0.351697 0.236105 0.227927 0.233424 0.231730 0.234462 0.259191 0.302322 0.234097 0.232672 0.233010
chargesum: 0.00000
title: Mulliken charges with hydrogens summed into heavy atoms:
elementType: Br Br O O C C C C C C C C C C C C C C C
charge: -0.005285 0.050527 -0.274230 -0.190874 -0.292958 -0.253183 0.588760 -0.157343 -0.078585 0.309533 0.010515 -0.006038 0.003605 0.394020 -0.138570 -0.011605 0.039010 0.022212 -0.009511
polarizability: 2.93179155e+02 -2.71424187e+01 1.64443572e+02 -6.96433498e+00 -1.01401265e+01 1.68449023e+02
1716.lowfreq: -4.7100 0.0005 0.0007 0.0008 4.5814 7.5216 18.6602 22.3152 26.2157
frequency: 18.5992 22.3067 26.2033 34.9006 60.4401 85.6394 92.2353 99.6247 134.7026 152.1446 171.4121 206.9027 226.6712 261.6195 270.8146 328.5250 400.0159 409.6985 425.1659 469.7132 498.9052 527.2019 544.4510 581.3877 606.9019 614.4022 617.2781 692.3797 696.0001 703.2985 718.1626 756.4721 766.8779 780.2651 836.4488 844.7342 845.1749 915.1819 926.8548 929.3171 976.0899 979.1332 987.3379 990.5249 997.5768 999.5812 1022.3168 1026.0349 1064.8839 1081.6294 1093.3674 1100.1632 1139.4932 1151.9766 1169.6465 1171.6164 1176.6506 1191.0817 1192.8071 1224.9872 1258.8710 1314.0855 1322.0519 1373.3619 1384.5324 1393.9283 1443.7964 1447.0169 1469.1765 1485.5072 1590.5260 1592.8203 1608.1393 1611.6239 1639.6135 3098.5147 3126.7617 3128.1414 3132.6239 3135.6880 3140.8481 3147.1284 3153.4406 3162.8487 3168.9799 3175.8050 3210.5508
redmass: 7.4471 4.3943 6.8315 4.6331 7.5281 8.3118 7.9906 14.1913 13.4292 5.6573 18.3457 6.2649 5.5447 6.3380 7.1836 6.5905 2.7523 2.9337 4.7932 4.9478 3.4753 5.9136 6.7171 5.4204 6.4161 5.5050 5.8483 2.2752 1.6331 6.9293 7.7603 7.0356 1.5132 1.9796 4.6945 1.2553 1.2782 2.9944 1.4046 1.9525 1.4002 1.3618 6.2928 6.1887 1.3073 1.3343 2.2898 2.2584 2.5037 1.5511 2.4011 1.8751 1.0961 2.6834 1.2669 1.0702 1.0800 1.2395 1.1980 1.8489 1.9065 1.3186 1.3915 2.1311 9.6437 3.3210 2.2680 2.1408 2.1879 2.3264 6.3007 5.9833 6.5296 6.0271 10.6946 1.0872 1.0858 1.0883 1.0871 1.0856 1.0917 1.0904 1.0963 1.0952 1.1016 1.0996 1.0948
irintensity: 0.5277 0.1986 0.4595 0.0887 0.0914 0.6565 0.6851 2.0869 1.4638 0.7719 1.8433 3.5815 4.0989 1.3187 2.3736 3.6723 0.1767 0.0394 20.0589 38.7172 33.1313 43.2596 15.3650 51.2340 1.1807 7.0139 6.5967 26.1227 60.2738 0.8543 16.3812 1.8455 94.3804 22.8223 27.3376 0.1104 0.2336 13.5035 8.6451 8.1005 0.1523 0.0786 5.4366 2.4405 1.2448 0.0409 7.4489 0.6796 9.5030 30.3699 133.5386 137.8759 20.6995 236.8371 17.9847 4.6771 4.5953 85.2404 10.1566 51.2062 40.8182 1.6623 20.2922 21.9149 9.1257 9.2570 8.2878 12.7114 77.9902 2.0562 17.2665 3.1664 6.7300 3.5169 204.5525 0.4082 4.9551 1.9608 0.1499 0.0618 11.8455 14.8978 31.4016 25.4602 21.6481 10.7544 4.2124
temp: 298.150 k
press: 1.00000 atm
elementType: 35 35 8 8 6 6 6 6 6 6 6 6 6 6 6 6 6 6 6 1 1 1 1 1 1 1 1 1 1 1 1
symmnumber: 1
zpe: 596651.3 jmol-1
zpe.correction: 0.227252 hartree
zpe.thermalcorrener: 0.245101 hartree
zpe.thermalcorrenthalpy: 0.246045 hartree
zpe.thermalcorrgfe: 0.176223 hartree
zpe.sumelectzpe: -754.819483 hartree
zpe.sumelectthermal: -754.801635 hartree
zpe.sumelectthermalent: -754.800691 hartree
zpe.sumelectthermalfe: -754.870512 hartree
dipole: 0.3871 -0.7157 1.6111
dipole: 1.8049
quadrupole: -95.7904 -139.9700 -120.8542
quadrupole: -3.2109 -2.6710 -3.0535
quadrupole: 23.0811 -21.0985 -1.9827 -3.2109 -2.6710 -3.0535
hfenergy: -755.0467357 hartree
pointgroup: C01[X(C15H12Br2O2)]
dipole: -0.1491665 -0.5791411 -0.3828725 debye
polarizability: 293.5601151|18.9659941|174.8065351|-19.2871868|6.2319894|157.7051008 unknown
InChI: InChI=1S/C15H12Br2O2/c16-13(11-7-3-1-4-8-11)14(17)15(18)19-12-9-5-2-6-10-12/h1-10,13-14H
charge 0 multiplicity 1
31 atoms
Br -1.179829 2.12086 -1.304914
Br -0.953006 -1.718486 1.575616
O  1.758265 -0.343934 -0.21051
O  0.973162 1.197367 1.39886
C  -1.698701 0.77003 0.220954
C  -0.579601 -0.265623 0.163873
C  -3.108804 0.304919 -0.000288
C  -4.143188 0.865285 0.79215
C  -3.439479 -0.664507 -0.983493
C  0.78416 0.308847 0.544192
C  -5.483042 0.458171 0.615093
C  -4.776976 -1.070717 -1.161238
C  -5.803409 -0.511362 -0.362346
C  3.171376 -0.118349 -0.10848
C  3.923305 -0.959464 -0.957636
C  3.788464 0.836884 0.731642
C  5.328466 -0.846674 -0.969273
C  5.199594 0.932124 0.703369
C  5.972317 0.10073 -0.13787
H  -1.589986 1.396896 1.119361
H  -0.527673 -0.820812 -0.781848
H  -3.894996 1.617674 1.550388
H  -2.656443 -1.094367 -1.6186
H  -6.272508 0.894849 1.236024
H  -5.022584 -1.819866 -1.921627
H  -6.842693 -0.828027 -0.502984
H  3.400036 -1.683221 -1.589386
H  3.193119 1.479109 1.380949
H  5.917166 -1.496549 -1.62521
H  5.691815 1.667529 1.348908
H  7.063772 0.188885 -0.146876
