program: Gaussian 09
title: 000231765
version: EM64L-G09RevD.01
frameworkgroup: C1[X(C12H16O4)]
method: RPBEPBE
basis: SDD
operation: Freq
keyword: #pfreq=noraman
keyword: PBEPBE/SDD
title: #p freq=noraman PBEPBE/SDD
converged: YES YES NO NO
title: Mulliken charges:
elementType: O O O O C C C C C C C C C C C C H H H H H H H H H H H H H H H H
charge: -0.275444 -0.270911 -0.244400 -0.239420 0.056474 0.540680 0.275443 0.241625 -0.546353 -0.617708 0.140884 -0.816824 -0.261581 -0.655230 -0.532302 -0.536981 0.244436 0.258852 0.228565 0.229968 0.229406 0.219470 0.230187 0.227908 0.252615 0.209934 0.222237 0.223772 0.242249 0.259291 0.230876 0.232280
chargesum: 0.00000
title: Mulliken charges with hydrogens summed into heavy atoms:
elementType: O O O O C C C C C C C C C C C C
charge: -0.275444 -0.270911 -0.244400 -0.239420 0.056474 0.540680 0.275443 0.241625 -0.301917 -0.358856 0.140884 -0.128885 0.188076 0.035227 0.155957 0.185467
polarizability: 1.87362379e+02 -1.88806634e+00 1.66205386e+02 -1.91447480e+00 1.67105159e+00 9.13924286e+01
1716.lowfreq: -7.7075 0.0007 0.0007 0.0010 1.5370 11.4592 31.2640 35.4015 48.3746
frequency: 30.8253 35.2570 48.3682 59.3394 76.6393 82.2959 95.0667 161.2932 168.3015 184.3820 188.0416 208.0166 220.9148 231.3403 260.4842 268.8965 286.2146 310.5047 337.4595 400.6368 416.3830 462.9354 482.9723 522.2104 574.0765 589.6386 603.2203 613.6643 712.8103 734.2688 761.0518 820.5566 824.9330 831.8731 864.9000 873.3259 922.2786 996.1831 1000.2617 1024.3390 1037.3931 1046.5848 1082.4740 1096.7594 1111.7958 1117.3502 1152.9254 1155.8840 1157.6078 1173.3810 1219.9661 1225.3978 1278.3262 1297.8089 1352.7807 1385.2861 1391.0409 1394.6303 1398.5402 1441.8929 1448.4070 1455.8004 1461.0686 1463.6909 1465.9989 1467.9365 1469.6911 1476.3401 1479.7786 1482.5114 1485.3619 1578.0775 1611.3348 1624.1712 2960.7251 2977.7430 2978.9663 2993.7728 3024.0830 3049.6512 3055.3215 3083.4079 3089.6700 3090.6128 3092.6955 3119.1774 3120.5601 3123.7706 3157.4679 3164.2558
redmass: 3.9140 1.0457 4.0800 3.0497 3.6466 3.3120 3.4209 4.6433 2.5695 2.2510 2.7470 2.3228 1.8880 2.7276 1.5050 1.4530 2.7829 2.7774 3.4057 4.6560 3.8402 5.8920 4.8940 6.0107 3.9177 4.9033 4.2238 4.5317 4.2745 4.0690 3.0235 1.4983 1.7190 2.9237 1.4509 7.2651 6.2847 2.7635 1.5295 4.6844 6.8206 1.5464 4.1532 2.1802 1.2586 1.2707 1.6831 1.6663 1.4911 1.5094 3.3117 1.7181 1.1200 6.1436 1.2872 4.9229 1.2342 1.3875 2.1328 1.2812 1.3038 1.1118 1.0522 1.4676 1.0569 1.0791 1.0461 1.1376 1.3357 1.0625 1.2789 6.7505 8.5833 7.4840 1.0327 1.0373 1.0323 1.0362 1.0597 1.1041 1.0976 1.1024 1.0974 1.0985 1.1038 1.1046 1.1031 1.0996 1.0906 1.0923
irintensity: 0.5314 0.4461 1.2539 0.4507 10.3261 1.8918 4.1872 1.0185 0.1449 0.5190 2.2179 1.4430 0.8104 1.5032 0.2073 0.1457 3.9586 11.8463 3.2634 5.8216 3.0877 2.5397 2.9873 8.6730 4.5844 5.6494 10.0444 4.8943 9.5499 7.2284 1.0081 9.7362 14.4462 20.3878 13.6262 16.4733 1.6404 5.9309 4.6923 62.3493 205.1244 13.1878 179.9072 31.8915 0.0809 6.6023 74.4317 19.8474 17.2526 48.7013 159.2515 103.0193 2.3686 50.0442 4.9189 26.0426 24.6801 21.4787 73.2032 7.2155 5.1160 17.9441 16.4545 47.9934 11.9369 14.7992 15.6777 22.1176 11.4409 49.5461 29.0309 189.3133 105.2076 219.4796 63.4842 51.1544 36.0503 21.2630 36.1926 41.1232 21.8605 26.9683 41.1735 19.9898 0.7768 33.3034 22.7298 20.9421 8.7374 2.8774
temp: 298.150 k
press: 1.00000 atm
elementType: 8 8 8 8 6 6 6 6 6 6 6 6 6 6 6 6 1 1 1 1 1 1 1 1 1 1 1 1 1 1 1 1
symmnumber: 1
zpe: 675029.0 jmol-1
zpe.correction: 0.257105 hartree
zpe.thermalcorrener: 0.274925 hartree
zpe.thermalcorrenthalpy: 0.275869 hartree
zpe.thermalcorrgfe: 0.210113 hartree
zpe.sumelectzpe: -766.521470 hartree
zpe.sumelectthermal: -766.503650 hartree
zpe.sumelectthermalent: -766.502706 hartree
zpe.sumelectthermalfe: -766.568462 hartree
dipole: -0.2521 -2.4755 -1.7393
dipole: 3.0359
quadrupole: -80.4874 -79.8504 -102.0008
quadrupole: -5.5155 3.9631 -3.2136
quadrupole: 6.9588 7.5958 -14.5546 -5.5155 3.9631 -3.2136
hfenergy: -766.7785751 hartree
pointgroup: C01 [X(C12H16O4)]
dipole: -0.076754 0.7281795 -0.9436703 debye
polarizability: 186.0287341|6.0373668|159.828374|8.7090177|-21.256741|99.1030855 unknown
InChI: InChI=1S/C12H16O4/c1-5-16-12(13)11-9(14-3)6-8(2)7-10(11)15-4/h6-7H,5H2,1-4H3
charge 0 multiplicity 1
32 atoms
O  -0.172031 1.818556 -0.33588
O  -0.203184 -2.915599 0.933966
O  2.070645 -0.071123 -0.622784
O  1.866613 -0.141684 1.697997
C  -0.108218 -0.481283 0.276475
C  -2.938502 -0.718058 -0.12496
C  -0.895772 0.626561 -0.170717
C  -0.778231 -1.709386 0.518424
C  -2.284143 0.519133 -0.374745
C  -2.182249 -1.815142 0.317082
C  1.344134 -0.219914 0.559686
C  -4.436667 -0.840641 -0.341775
C  3.494371 0.366566 -0.477918
C  3.576096 1.889733 -0.340114
C  -0.904174 3.007566 -0.77257
C  1.253283 -3.105196 0.969351
H  -2.871091 1.378618 -0.711263
H  -2.647681 -2.786321 0.508041
H  -4.709256 -0.6102 -1.388919
H  -4.79524 -1.858584 -0.115172
H  -4.992648 -0.13426 0.30318
H  3.968472 0.007158 -1.405389
H  3.933997 -0.140722 0.399419
H  3.070867 2.383836 -1.187299
H  3.100631 2.221968 0.597279
H  4.635632 2.207056 -0.327578
H  -1.363847 2.853206 -1.767929
H  -1.685732 3.290239 -0.040804
H  -0.146974 3.803157 -0.832211
H  1.701622 -2.584768 1.832404
H  1.722984 -2.755859 0.030411
H  1.388593 -4.192914 1.068015
