program: Gaussian 09
title: 000231768
version: EM64L-G09RevD.01
frameworkgroup: C1[X(C14H20O)]
method: RPBEPBE
basis: SDD
operation: Freq
keyword: #pfreq=noraman
keyword: PBEPBE/SDD
title: #p freq=noraman PBEPBE/SDD
converged: YES YES NO NO
title: Mulliken charges:
elementType: O C C C C C C C C C C C C C C H H H H H H H H H H H H H H H H H H H H
charge: -0.210361 0.395943 0.395939 0.031372 0.531571 -0.632751 -0.632523 -0.546141 -0.545658 -0.546630 0.045204 -0.682877 -0.683092 -0.673995 -0.752759 0.243780 0.243856 0.201341 0.214471 0.201204 0.214411 0.208468 0.208514 0.253230 0.213671 0.217446 0.217238 0.213524 0.253950 0.223338 0.216433 0.223314 0.254689 0.241838 0.242041
chargesum: 0.00000
title: Mulliken charges with hydrogens summed into heavy atoms:
elementType: O C C C C C C C C C C C C C C
charge: -0.210361 0.395943 0.395939 0.031372 0.531571 -0.388971 -0.388667 -0.130328 -0.130043 -0.129648 0.045204 0.001471 0.001620 -0.010909 -0.014191
polarizability: 1.83390281e+02 -1.42364820e-02 1.62530366e+02 -3.46138732e+00 5.42973207e-02 1.14049013e+02
1716.lowfreq: 0.0000 0.0001 0.0003 1.5398 8.0227 14.8713 25.4226 31.8850 52.9844
frequency: 25.1153 31.7812 52.8944 75.4835 79.9809 90.5873 120.8427 145.7071 154.3082 170.1266 197.5490 205.6318 229.3621 256.7552 276.1734 286.9336 302.4045 323.7498 343.7476 446.1732 493.8344 502.3175 526.7435 570.2577 606.1078 625.0321 645.7582 663.1252 778.1622 782.2550 790.0491 800.1255 883.3785 892.0296 895.5007 908.6288 948.4494 967.1067 994.6481 1000.7417 1023.3034 1054.0318 1058.9039 1061.9780 1064.8676 1072.1788 1076.3273 1089.8606 1172.2378 1230.1633 1237.1977 1243.2238 1259.2222 1266.9592 1281.8571 1306.7161 1307.3520 1331.1904 1367.1723 1369.3612 1387.4178 1389.0996 1392.4898 1423.7111 1437.9016 1445.8327 1462.6366 1470.2331 1471.8748 1472.0798 1475.7547 1477.7617 1479.0045 1489.8161 1492.1279 1493.5701 1576.8778 1607.6800 1614.3315 2979.3527 2980.4506 2981.5556 2981.8018 2984.2261 2984.7406 2985.4708 3034.3003 3034.9752 3036.0067 3063.8372 3077.6081 3078.4647 3078.9464 3083.5005 3092.1329 3092.4489 3104.7881 3109.0202 3116.2134
redmass: 4.9311 2.4134 3.3768 2.4184 3.0559 3.2691 1.2377 2.7592 3.5216 2.4599 1.2009 1.2117 1.0983 3.9706 2.2632 2.1736 2.1600 3.3332 2.9305 2.3779 3.4711 4.3840 5.4533 3.4743 2.6391 3.6198 3.3829 3.1969 3.6048 1.1727 1.2039 1.1920 2.7139 2.9526 1.5830 1.3711 2.4197 2.2997 1.9276 2.4481 1.9303 2.8500 1.9994 2.0371 1.9930 1.4749 1.5497 1.6776 1.5917 1.3506 1.6844 1.2652 1.9160 1.3465 1.6999 1.4141 1.3929 3.0233 1.2431 4.7594 1.1979 1.2162 1.2215 2.8490 1.0857 1.0969 2.7275 1.0432 1.0414 1.0470 1.1233 1.0640 1.0821 1.0945 1.0865 1.0888 7.6826 8.1026 6.2100 1.0352 1.0368 1.0372 1.0370 1.0575 1.0581 1.0584 1.1014 1.1013 1.1017 1.0955 1.1001 1.1002 1.1000 1.1011 1.1012 1.1012 1.0907 1.0916 1.1015
irintensity: 5.1557 0.0675 0.4703 0.4228 0.9863 1.4341 1.0205 0.1216 1.6338 0.0482 0.0294 0.1284 0.0000 2.8268 0.9206 0.0105 0.0481 1.5616 0.0475 0.4875 0.3085 0.1390 9.6442 0.9745 1.0212 0.0111 12.0171 1.0414 3.9918 2.9931 5.1317 0.0126 13.6077 7.5244 27.2674 0.5074 13.1624 1.2886 0.5429 0.2091 0.1198 2.5860 9.0308 24.4981 14.8058 4.8388 6.6997 15.6850 6.1659 0.0038 37.5982 0.0113 40.7879 0.0208 3.2809 2.1089 1.0531 2.1058 71.9458 0.5805 2.4398 0.6060 40.9835 11.4297 26.8620 12.1362 2.0516 11.1074 7.7081 17.2027 1.6206 1.0551 9.0631 10.8714 10.2728 14.9976 16.1400 91.7173 43.1273 36.4114 0.1754 17.4687 69.2072 39.4033 32.8098 32.6791 12.1272 21.6786 11.4534 8.4553 81.4932 46.0888 38.3823 34.2680 27.0316 20.6283 27.9044 12.7301 17.7000
temp: 298.150 k
press: 1.00000 atm
elementType: 8 6 6 6 6 6 6 6 6 6 6 6 6 6 6 1 1 1 1 1 1 1 1 1 1 1 1 1 1 1 1 1 1 1 1
symmnumber: 1
zpe: 788959.4 jmol-1
zpe.correction: 0.300499 hartree
zpe.thermalcorrener: 0.317861 hartree
zpe.thermalcorrenthalpy: 0.318805 hartree
zpe.thermalcorrgfe: 0.254272 hartree
zpe.sumelectzpe: -619.574335 hartree
zpe.sumelectthermal: -619.556973 hartree
zpe.sumelectthermalent: -619.556029 hartree
zpe.sumelectthermalfe: -619.620562 hartree
dipole: 1.6510 -0.0268 -2.2243
dipole: 2.7702
quadrupole: -91.0953 -84.4782 -95.7520
quadrupole: 0.0798 7.1592 -0.0499
quadrupole: -0.6535 5.9636 -5.3102 0.0798 7.1592 -0.0499
hfenergy: -619.8748337 hartree
pointgroup: C01 [X(C14H20O1)]
dipole: -0.6618194 -0.0218803 0.8656536 debye
polarizability: 183.472441|0.232556|162.5319535|-2.4718652|0.198027|113.965265 unknown
InChI: InChI=1S/C14H20O/c1-5-11-8-12(6-2)14(10(4)15)13(7-3)9-11/h8-9H,5-7H2,1-4H3
charge 0 multiplicity 1
35 atoms
O  2.897934 0.049866 -0.939871
C  0.090415 -1.23741 0.293702
C  0.065428 1.238525 0.309099
C  0.781335 0.007883 0.260379
C  -2.057518 -0.022095 0.479453
C  -1.32016 -1.228311 0.410785
C  -1.344665 1.199525 0.426087
C  0.826918 -2.563767 0.143261
C  0.775336 2.581432 0.178767
C  -3.577393 -0.03804 0.562762
C  2.296858 0.024129 0.169513
C  0.997605 -2.969131 -1.347084
C  0.937714 3.013064 -1.305044
C  -4.244493 -0.032906 -0.839462
C  3.059944 0.011648 1.490321
H  -1.853893 -2.187533 0.448774
H  -1.897338 2.147337 0.476623
H  1.829788 -2.51518 0.610227
H  0.269051 -3.358314 0.674484
H  1.77907 2.545332 0.645001
H  0.201942 3.356276 0.722423
H  -3.914355 -0.93506 1.117042
H  -3.932454 0.84237 1.132174
H  1.586561 -2.210313 -1.891311
H  1.517662 -3.941047 -1.431404
H  0.014129 -3.059012 -1.842788
H  -0.047263 3.089214 -1.800078
H  1.436684 3.997165 -1.374121
H  1.543297 2.275255 -1.859757
H  -3.953391 0.866857 -1.411273
H  -5.346616 -0.044872 -0.752511
H  -3.935156 -0.916715 -1.426375
H  4.146577 0.011889 1.309764
H  2.78043 0.8934 2.097841
H  2.777014 -0.876065 2.086995
