program: Gaussian 09
title: 000231778
version: EM64L-G09RevD.01
frameworkgroup: C1[X(C22H20O)]
method: RPBEPBE
basis: SDD
operation: Freq
keyword: #pfreq=noraman
keyword: PBEPBE/SDD
title: #p freq=noraman PBEPBE/SDD
converged: YES YES NO NO
title: Mulliken charges:
elementType: O C C C C C C C C C C C C C C C C C C C C C C H H H H H H H H H H H H H H H H H H H H
charge: -0.216115 -0.291491 -0.649607 0.352664 0.445143 0.236041 0.143115 -0.386786 -0.376683 -0.415348 -0.408336 -0.845407 0.282099 -0.253341 -0.247238 -0.242932 -0.250860 -0.246529 -0.346917 -0.349267 -0.247832 -0.228376 -0.224451 0.257026 0.242621 0.269166 0.253347 0.236690 0.232784 0.228664 0.235109 0.238722 0.229010 0.225272 0.225078 0.223887 0.222771 0.226479 0.241732 0.279464 0.231799 0.234427 0.234409
chargesum: 0.00000
title: Mulliken charges with hydrogens summed into heavy atoms:
elementType: O C C C C C C C C C C C C C C C C C C C C C C
charge: -0.216115 -0.034465 -0.137820 0.352664 0.445143 0.236041 0.143115 -0.133439 -0.139993 -0.182565 -0.179672 -0.142567 0.282099 -0.028070 -0.022160 -0.019044 -0.028089 -0.020051 -0.105186 -0.069803 -0.016033 0.006051 0.009959
polarizability: 2.82901626e+02 1.70736902e+01 2.18981793e+02 -9.03593963e+00 2.00802655e+00 1.97072746e+02
1716.lowfreq: -12.9050 -7.7549 -0.0005 0.0004 0.0005 1.7032 6.9609 13.7451 27.6795
frequency: 6.0659 13.0806 27.6048 38.6317 50.4131 62.0316 68.0764 134.3669 148.4554 157.8067 178.5033 184.3549 218.0444 229.2455 260.8412 276.5535 323.8306 399.3861 402.1413 404.6421 416.0597 425.1787 448.7122 463.1354 487.4930 528.3436 555.7289 573.3499 601.5476 613.2773 615.9533 623.0176 654.3922 696.5324 702.0270 725.9619 739.1888 754.3789 762.8447 776.8125 783.0124 813.6867 851.0374 858.9738 862.3050 878.9105 918.6003 935.7555 950.6660 962.8577 975.7618 976.5349 986.2880 988.8608 989.5681 990.9087 991.2541 993.4024 1011.0922 1025.3069 1029.0209 1039.8392 1047.7969 1060.4985 1086.5022 1089.5458 1103.3221 1167.1677 1172.6969 1173.4278 1173.5292 1182.3931 1189.1131 1196.1170 1201.6231 1213.8515 1236.8180 1255.3605 1290.8193 1308.8781 1315.4102 1326.7421 1351.6181 1372.5995 1383.3137 1387.0862 1401.7990 1431.0281 1434.1458 1435.7933 1444.3155 1472.5265 1476.0569 1479.0411 1483.4866 1486.4073 1567.4323 1583.4469 1591.8808 1596.5677 1611.2041 1612.4316 1614.9750 2973.3275 2975.6511 3008.5291 3046.9428 3047.6722 3080.5764 3114.8520 3116.9573 3122.0601 3122.6092 3129.5383 3135.6256 3137.1230 3139.2553 3145.1642 3150.4541 3157.7387 3159.8845 3161.9807 3170.1971
redmass: 5.5937 3.9586 3.8555 3.8811 4.6180 4.6334 6.9475 4.0958 4.9742 1.1593 3.4240 3.9418 4.3151 3.1129 3.9480 3.8891 4.5638 2.8180 2.8157 2.9229 3.3023 4.7006 3.4956 3.6453 3.8589 4.6378 3.0398 3.4032 4.2108 6.4102 6.0032 4.7343 5.9867 1.8178 1.9201 2.8561 2.1987 2.2576 1.6039 2.2647 3.0191 3.4398 1.2514 1.2496 2.6512 1.4378 1.4973 1.5749 1.4747 2.1397 1.4046 3.9036 1.6422 1.4326 4.2519 3.0155 1.8652 1.3159 1.3525 2.2532 2.2050 1.5857 2.1736 2.6002 1.6143 1.8585 1.9128 1.2629 1.0599 1.0832 1.0754 1.7509 1.1572 1.1214 2.2415 2.2012 2.3450 1.9266 1.4713 1.4382 1.5238 1.4094 1.4147 5.4924 5.3448 9.0508 1.2536 2.0719 1.9859 2.1142 1.2026 1.0953 1.5346 2.0916 1.5649 2.2406 7.1298 6.3258 5.9791 6.6910 6.3259 6.2151 6.0750 1.0387 1.0640 1.0814 1.0937 1.0961 1.0985 1.0855 1.0855 1.0886 1.0864 1.0851 1.0915 1.0936 1.0880 1.0957 1.0925 1.1007 1.0960 1.1015 1.1012
irintensity: 0.9668 0.0806 0.1340 0.2152 0.2714 0.4942 2.6225 0.1330 0.3426 0.7478 1.2818 0.5394 0.9432 3.3847 0.8434 5.4572 4.7684 0.0081 0.1989 1.5863 0.8644 0.6293 4.1958 1.8511 11.5237 10.1373 7.3558 22.1706 6.7493 0.5182 6.3547 6.6748 6.3766 46.9791 38.2957 24.8526 21.9771 57.1349 41.2538 33.9470 2.8953 2.2397 0.3640 0.6849 2.6950 0.1542 1.2707 6.0705 2.6108 3.0475 0.8758 46.7368 1.3476 0.2617 6.0681 1.2140 0.7071 0.1165 0.2835 5.2087 5.5967 6.2026 11.6071 6.1225 9.3235 1.3560 7.5739 1.1438 0.1317 1.5658 3.1192 0.3226 38.5215 0.9520 20.5620 14.9592 28.2734 125.6807 53.9644 3.5459 8.6566 24.4086 14.7625 0.2297 2.1725 2.6519 14.5787 2.9412 6.7333 20.9855 24.7310 18.0940 18.2980 4.7915 29.7587 18.6607 86.7583 1.7185 2.0191 30.6040 11.1849 9.9617 8.0349 27.6299 14.2917 3.9463 16.3777 13.2995 30.8535 10.1074 6.2600 4.3259 1.4578 0.2994 17.2675 35.1752 5.9764 52.4351 18.4453 35.1654 18.3941 22.7967 23.6426
temp: 298.150 k
press: 1.00000 atm
elementType: 8 6 6 6 6 6 6 6 6 6 6 6 6 6 6 6 6 6 6 6 6 6 6 1 1 1 1 1 1 1 1 1 1 1 1 1 1 1 1 1 1 1 1
symmnumber: 1
zpe: 919130.2 jmol-1
zpe.correction: 0.350078 hartree
zpe.thermalcorrener: 0.370203 hartree
zpe.thermalcorrenthalpy: 0.371147 hartree
zpe.thermalcorrgfe: 0.296705 hartree
zpe.sumelectzpe: -923.965074 hartree
zpe.sumelectthermal: -923.944950 hartree
zpe.sumelectthermalent: -923.944005 hartree
zpe.sumelectthermalfe: -924.018448 hartree
dipole: 1.4856 -1.2170 -2.2186
dipole: 2.9343
quadrupole: -116.5684 -129.3378 -134.3161
quadrupole: 0.1229 -7.5110 -1.1098
quadrupole: 10.1724 -2.5971 -7.5753 0.1229 -7.5110 -1.1098
hfenergy: -924.3151527 hartree
pointgroup: C01[X(C22H20O1)]
dipole: -0.56022 0.6965707 -0.7305629 debye
polarizability: 285.5803049|9.7763192|216.9532457|9.3948706|1.424893|196.422615 unknown
InChI: InChI=1S/C22H20O/c1-17-10-8-9-15-20(17)21(18-11-4-2-5-12-18)16-22(23)19-13-6-3-7-14-19/h2-15,21H,16H2,1H3
charge 0 multiplicity 1
43 atoms
O  -1.429572 -0.354903 2.008912
C  0.96124 -0.162499 0.459231
C  -0.284816 0.707639 0.142266
C  2.226923 0.615531 0.061173
C  0.909766 -1.573507 -0.148649
C  2.874716 1.482345 0.995264
C  -1.538399 0.29067 0.924614
C  2.722515 0.532084 -1.264382
C  1.958975 -2.478157 0.167667
C  -0.131879 -2.032166 -0.991098
C  3.998846 2.231914 0.563198
C  2.398519 1.612432 2.434647
C  -2.893872 0.704581 0.419718
C  3.840002 1.286923 -1.680945
C  4.4835 2.143869 -0.760727
C  1.969448 -3.79357 -0.3386
C  -0.126887 -3.351393 -1.504396
C  0.922887 -4.238044 -1.182086
C  -3.06939 1.561895 -0.700621
C  -4.041886 0.225825 1.109881
C  -4.365741 1.931268 -1.120072
C  -5.334817 0.588156 0.685946
C  -5.500449 1.44294 -0.431462
H  0.960623 -0.302526 1.557411
H  -0.474863 0.731114 -0.945708
H  -0.066901 1.757785 0.42905
H  2.232435 -0.148262 -1.970797
H  2.777408 -2.137956 0.814123
H  -0.968399 -1.374076 -1.250581
H  4.501649 2.893539 1.279461
H  1.344008 1.94064 2.502004
H  2.463715 0.650374 2.977803
H  3.012011 2.347226 2.983337
H  4.206993 1.203714 -2.710142
H  5.355017 2.73355 -1.067005
H  2.789254 -4.472253 -0.076789
H  -0.946806 -3.684172 -2.151259
H  0.925953 -5.260156 -1.577142
H  -2.201794 1.953907 -1.241449
H  -3.886197 -0.427898 1.974545
H  -4.492206 2.596819 -1.980882
H  -6.212813 0.209662 1.220572
H  -6.506018 1.726836 -0.761632
