program: Gaussian 09
title: 000231738
version: EM64L-G09RevD.01
frameworkgroup: C1[X(C11H10N4)]
method: RPBEPBE
basis: SDD
operation: Freq
keyword: #pfreq=noraman
keyword: PBEPBE/SDD
title: #p freq=noraman PBEPBE/SDD
converged: NO YES NO NO
title: Mulliken charges:
elementType: N N N N C C C C C C C C C C C H H H H H H H H H H
charge: -0.062254 -0.100437 0.020490 0.020516 0.425414 0.469545 -0.584282 -0.027075 -0.350679 -0.314903 -0.771754 -0.803151 -0.136319 -0.127495 -0.127935 0.242667 0.242741 0.255062 0.251525 0.251820 0.216599 0.231883 0.238937 0.238855 0.300230
chargesum: 0.00000
title: Mulliken charges with hydrogens summed into heavy atoms:
elementType: N N N N C C C C C C C C C C C
charge: -0.062254 -0.100437 0.020490 0.020516 0.425414 0.469545 -0.341615 -0.027075 -0.107937 -0.059840 -0.051811 -0.093476 0.163911 -0.127495 -0.127935
polarizability: 2.50110625e+02 -9.27406114e+00 1.23105902e+02 -3.33050303e-01 6.50996841e-01 9.94209828e+01
1716.lowfreq: -8.1758 -3.7253 0.0004 0.0004 0.0008 3.6215 15.0001 20.3372 41.2960
frequency: 14.6343 20.2611 41.2917 69.5539 80.1705 114.0610 185.8380 197.6186 202.6958 211.1888 271.3221 274.7499 295.0639 346.9262 363.2707 394.6314 451.5000 459.4222 508.4769 509.3749 542.4989 565.0602 576.3353 643.0622 713.7134 738.9069 759.0496 842.4439 876.8284 888.0751 918.6170 956.1154 981.0490 987.1907 1010.6948 1021.7733 1040.3431 1046.2240 1120.2973 1167.0366 1188.1886 1223.3324 1247.6151 1285.0870 1286.0182 1361.1896 1375.4583 1395.3536 1400.6956 1412.3577 1449.0858 1462.7425 1467.9904 1475.3836 1478.6281 1558.4414 1620.8519 2207.6847 2208.0790 2964.0071 2981.2588 2987.6957 3058.7012 3067.8702 3093.6413 3094.4990 3126.6836 3137.6913 3166.3600
redmass: 1.1578 3.6345 7.0356 4.5517 6.4537 11.7186 1.8480 3.1210 7.3729 2.0981 4.0264 4.9088 3.1171 4.3040 8.3541 5.3435 3.1326 3.4377 7.6960 7.6022 5.1861 12.3359 3.0939 6.7438 5.6264 3.1149 5.4528 1.3667 9.1389 1.2724 3.8830 4.4551 1.3582 1.4718 3.6968 1.5285 1.6030 1.6152 1.9902 1.6359 1.6570 1.7903 2.6619 1.3539 1.6009 5.8380 4.6862 1.5871 1.4584 1.5885 1.0456 1.2636 1.0461 1.4843 1.8383 6.0045 6.3254 12.6203 12.5776 1.0806 1.0378 1.0365 1.0970 1.0951 1.1015 1.0989 1.0913 1.0889 1.0965
irintensity: 0.2078 1.2318 0.0646 0.2114 4.8705 3.1108 1.3358 2.5258 5.7836 0.4814 3.0048 1.3042 1.3011 7.3702 0.0009 1.9080 6.1241 10.5470 0.5838 10.3505 1.3730 0.9780 3.5394 3.3592 1.1933 0.1476 3.9003 40.3317 11.1393 1.1861 8.9106 0.6724 0.4121 5.4226 19.3972 2.9577 1.6748 19.0572 28.6808 2.3283 19.3486 9.6513 18.2769 2.2909 3.1825 71.8960 114.4290 4.6694 32.9080 8.4894 13.4131 11.7620 15.1328 13.3706 21.9476 25.5762 98.8895 8.7080 0.4497 9.6379 18.9215 9.6902 13.9918 7.4158 20.6300 24.9627 22.1985 9.9996 9.3789
temp: 298.150 k
press: 1.00000 atm
elementType: 7 7 7 7 6 6 6 6 6 6 6 6 6 6 6 1 1 1 1 1 1 1 1 1 1
symmnumber: 1
zpe: 485623.8 jmol-1
zpe.correction: 0.184964 hartree
zpe.thermalcorrener: 0.199955 hartree
zpe.thermalcorrenthalpy: 0.200900 hartree
zpe.thermalcorrgfe: 0.139929 hartree
zpe.sumelectzpe: -643.026375 hartree
zpe.sumelectthermal: -643.011384 hartree
zpe.sumelectthermalent: -643.010440 hartree
zpe.sumelectthermalfe: -643.071410 hartree
dipole: 7.1942 -1.2935 -0.0746
dipole: 7.3099
quadrupole: -92.9747 -79.4660 -102.2928
quadrupole: 6.0214 0.3102 1.0242
quadrupole: -1.3969 12.1118 -10.7150 6.0214 0.3102 1.0242
hfenergy: -643.2113391 hartree
pointgroup: C01 [X(C11H10N4)]
dipole: -2.7913054 0.6880097 -0.0798305 debye
dipolederiv: 1.2640516 -0.0210538 0.1564435 -0.1200457 -0.1398848 -0.0139732 0.1159562 -0.0024735 -0.1272918 -0.30044 -0.0087111 -0.0115772 0.7435465 -0.112271 0.1258591 0.2680271 0.0379393 -0.1746867 -0.1734036 -0.0263048 0.006845 0.0779162 -0.1629267 -0.0031032 -0.0886239 -0.0339546 -0.188408 -0.1939838 -0.0219216 -0.0288319 0.0023726 -0.1903971 0.0032408 0.1115935 0.0193083 -0.1409185 0.3875191 -0.3047879 -0.0739217 0.24597 0.2046948 0.087819 0.1291477 0.0238855 0.071305 0.7262151 -0.0318412 0.0696376 -0.0316773 0.1949485 0.0615161 0.0690598 0.0616556 0.0504203 -0.5549695 0.3159976 0.0739237 0.3307959 -0.0854867 0.073371 0.079571 0.0714076 -0.1438571 -0.9519605 0.024453 -0.1038951 -0.2853253 -0.0396185 -0.0541817 -0.2157314 -0.0180639 -0.0154539 -0.4451574 -0.2048537 -0.1051827 -0.382494 -0.0462507 0.0106964 -0.1709523 0.0314426 -0.2023829 0.4083769 0.1056381 0.0963833 -0.3021877 0.0295233 0.0074264 -0.0537875 0.0552805 -0.0718909 -0.0067266 0.2633699 0.0958465 0.0858576 -0.0760763 -0.0240279 0.02988 -0.0035581 0.017169 -0.3265464 0.0211819 -0.0351293 0.1700383 0.0614683 0.0257418 0.0211469 0.0085089 0.0505382 0.263713 0.0069716 -0.017928 0.0617472 0.3846765 -0.0082989 0.0004487 -0.0144651 0.4214401 -0.1802613 0.0008432 0.0300718 -0.212807 -0.0090602 -0.0452592 0.1465263 -0.0354213 -0.0158695 -0.1180717 0.0237056 -0.0520164 -0.0638868 -0.0480098 0.004364 -0.2760939 0.0300973 -0.0369952 0.0229248 -0.0542414 -0.0338999 -0.0938795 -0.0396661 -0.0779206 -0.0483429 -0.0734931 0.107616 -0.002764 0.0985037 0.0186231 0.1038536 -0.0156972 -0.0505375 0.0205574 -0.0512088 0.1359604 0.0828338 -0.0723621 -0.0345679 -0.0404196 0.0060571 -0.0581498 -0.022857 -0.0618675 0.1245233 0.01687 -0.0232612 0.0894996 -0.0376315 0.045055 0.0353272 0.0895767 0.001338 0.0211793 0.0564874 0.0353709 -0.0744466 0.0315891 0.0475913 0.0048746 -0.081407 0.040938 -0.0206405 -0.0286354 -0.1666521 -0.0777008 -0.0657945 -0.0425584 -0.0624808 -0.0400079 -0.074303 0.0718691 0.0499578 -0.0036996 -0.008309 -0.1182616 -0.0820291 -0.0856533 -0.0513914 -0.0724242 0.0779441 -0.0250563 0.0049674 0.0514596 -0.0308124 0.1074922 -0.0531913 0.1012499 -0.0323873 -0.0581491 0.007597 0.0202955 -0.0378915 0.0222947 -0.0108095 0.1080082 -0.1004694 0.0911069 0.0275885 0.02143 0.0183918 0.0065643 -0.0907588 0.019235 -0.0114671 -0.0330765 0.0007117 0.0189907 unknown
polarizability: 247.4578554|-18.7800338|122.0631392|10.2521286|6.5037671|103.1165147 unknown
InChI: InChI=1S/C11H10N4/c1-8-3-4-11(9(2)5-8)15-14-10(6-12)7-13/h3-5,10H,1-2H3
charge 0 multiplicity 1
25 atoms
N  0.544193 0.605018 0.453993
N  1.407019 -0.337294 0.207249
N  3.801165 -1.346241 2.515452
N  4.295727 0.158051 -1.659245
C  -1.420054 -0.867451 -0.319668
C  -3.656681 0.228637 -0.169805
C  -2.826361 -0.877119 -0.485416
C  -0.833103 0.340765 0.197297
C  -3.048075 1.408686 0.338866
C  -1.659723 1.45787 0.516886
C  -0.624775 -2.100459 -0.687704
C  -5.157646 0.160147 -0.368277
C  2.817178 0.18513 0.563026
C  3.381539 -0.666432 1.631398
C  3.652793 0.158554 -0.656048
H  -3.292645 -1.788747 -0.878504
H  -3.666718 2.277312 0.590341
H  -1.164576 2.353184 0.906446
H  0.135852 -1.875837 -1.456719
H  -0.053737 -2.486127 0.1757
H  -1.293665 -2.893996 -1.062014
H  -5.474682 -0.816684 -0.769363
H  -5.692371 0.326034 0.585774
H  -5.501391 0.943866 -1.069179
H  2.737939 1.23093 0.931114
