program: Gaussian 09
title: 000231739
version: EM64L-G09RevD.01
frameworkgroup: C1[X(C14H15N3)]
method: RPBEPBE
basis: SDD
operation: Freq
keyword: #pfreq=noraman
keyword: PBEPBE/SDD
title: #p freq=noraman PBEPBE/SDD
converged: YES YES NO NO
title: Mulliken charges:
elementType: N N N C C C C C C C C C C C C C C H H H H H H H H H H H H H H H
charge: -0.148631 -0.055329 0.003210 0.403065 0.525980 -0.357300 -0.369171 -0.404369 -0.424940 -0.646864 -0.645301 -0.312117 -0.327915 0.230622 -0.410882 -0.306534 -0.272788 0.236530 0.237937 0.221641 0.230464 0.237223 0.219032 0.237374 0.218460 0.237784 0.237487 0.272682 0.219282 0.237345 0.235362 0.240660
chargesum: 0.00000
title: Mulliken charges with hydrogens summed into heavy atoms:
elementType: N N N C C C C C C C C C C C C C C
charge: -0.148631 -0.055329 0.003210 0.403065 0.525980 -0.120771 -0.131233 -0.182729 -0.194475 0.046765 0.048430 -0.039435 -0.108633 0.230622 -0.173537 -0.071172 -0.032128
polarizability: 4.81407896e+02 -7.17158847e-02 1.63068014e+02 -1.23553517e-01 -1.62945232e-01 7.72668121e+01
1716.lowfreq: -3.9551 -0.0007 -0.0005 0.0007 4.6821 10.4743 35.6860 38.1173 56.4141
frequency: 35.5814 38.0942 56.2853 76.0713 85.1708 119.0121 158.2479 160.5664 202.0444 211.6421 218.0393 256.4895 283.7379 376.2646 395.3682 402.7543 424.2133 446.2254 497.8065 500.9017 524.6048 544.0665 594.6595 635.5944 659.5694 725.3803 737.5407 759.0945 804.4672 816.5404 828.8819 835.8023 871.6569 878.5977 923.7738 943.2282 945.5632 948.8926 957.1907 967.7161 995.9125 1004.7188 1033.6908 1056.6501 1107.0461 1111.4046 1132.2024 1140.9244 1167.5219 1198.7745 1218.4815 1230.5290 1254.4145 1259.7829 1296.6435 1302.3020 1328.6639 1336.9210 1367.9302 1375.0754 1391.6031 1430.4688 1445.3834 1451.2187 1460.2126 1464.9844 1476.7967 1481.4794 1493.7888 1506.9058 1522.4365 1534.9773 1550.5796 1621.1751 1642.5040 2944.2921 2951.5191 3011.3953 3014.1273 3099.6322 3100.5923 3109.2608 3112.2914 3121.5004 3122.2691 3125.1417 3132.7228 3158.0432 3164.0909 3169.1333
redmass: 4.9029 3.8398 4.9906 2.3475 4.8731 1.8832 5.2829 1.9838 1.1422 4.5238 2.4100 2.2863 4.0484 3.2096 3.6534 4.3379 3.0104 4.2267 3.6861 3.0131 3.9082 2.9487 8.7205 7.1343 6.1009 5.0501 3.2625 2.4128 1.2700 1.6294 6.0919 1.6313 4.4446 1.6775 1.6154 3.1211 1.3753 1.4186 1.3526 5.6093 2.9051 1.2106 2.8628 1.5000 1.2380 1.3234 1.5835 2.2940 1.6988 1.2531 1.6065 1.7078 3.7427 2.8779 1.8421 1.6506 1.4597 1.4666 2.7186 3.2275 2.5285 1.2479 2.3038 2.7841 1.2378 1.0399 1.0457 5.1192 1.1160 1.1676 3.4652 3.1349 6.1352 5.5102 5.9728 1.0368 1.0392 1.0994 1.1029 1.0963 1.0914 1.0943 1.0879 1.0914 1.0896 1.0880 1.0875 1.0981 1.0936 1.0937
irintensity: 1.0933 0.2124 0.3332 0.0031 0.4244 4.8741 0.0130 0.3644 0.0035 0.1207 0.0059 2.8880 0.5475 0.0117 0.6694 16.0650 1.4451 3.7929 0.8616 11.8417 17.6137 9.0256 1.5910 0.6663 3.9972 5.4674 0.5749 12.9118 0.0025 35.8802 0.0178 68.6250 0.3592 14.6278 7.5318 34.3781 3.3389 0.1079 0.4138 16.1054 0.1009 43.0055 5.4168 26.3380 0.0178 1.0677 2.2545 58.3788 6.8390 187.0277 43.5285 5.3551 3.1579 28.0662 15.7326 15.3198 6.6890 25.4632 272.2235 70.3017 9.7741 8.9404 134.7665 45.4391 52.9209 0.0121 22.8091 199.7434 0.9433 76.8603 7.4756 495.4660 17.2460 866.8043 6.4255 99.5186 184.9785 2.8816 81.5629 4.2161 0.2795 50.0250 7.2311 20.2334 40.3486 5.4010 6.8355 45.0634 25.3614 20.9137
temp: 298.150 k
press: 1.00000 atm
elementType: 7 7 7 6 6 6 6 6 6 6 6 6 6 6 6 6 6 1 1 1 1 1 1 1 1 1 1 1 1 1 1 1
symmnumber: 1
zpe: 679344.0 jmol-1
zpe.correction: 0.258748 hartree
zpe.thermalcorrener: 0.274396 hartree
zpe.thermalcorrenthalpy: 0.275340 hartree
zpe.thermalcorrgfe: 0.214392 hartree
zpe.sumelectzpe: -705.497381 hartree
zpe.sumelectthermal: -705.481734 hartree
zpe.sumelectthermalent: -705.480790 hartree
zpe.sumelectthermalfe: -705.541738 hartree
dipole: 6.8727 -0.1984 0.0156
dipole: 6.8756
quadrupole: -79.1319 -92.4446 -106.8917
quadrupole: 9.5208 -0.0055 0.0209
quadrupole: 13.6908 0.3781 -14.0689 9.5208 -0.0055 0.0209
hfenergy: -705.7561299 hartree
pointgroup: C01 [X(C14H15N3)]
dipole: 2.7042951 -0.0557722 -0.0333519 debye
polarizability: 481.3257832|2.6906248|162.3291203|-4.9641208|8.0084075|78.0878182 unknown
InChI: InChI=1S/C14H15N3/c1-17(2)14-7-4-12(5-8-14)3-6-13-11-15-9-10-16-13/h3-11H,1-2H3
charge 0 multiplicity 1
32 atoms
N  4.978669 0.157366 -0.048265
N  -3.565389 -1.070988 -0.051834
N  -5.460934 1.061921 0.164549
C  3.588992 0.030191 -0.04619
C  0.704457 -0.22387 -0.036408
C  2.736828 1.179631 0.077764
C  2.956296 -1.250048 -0.166392
C  1.342823 1.048101 0.081769
C  1.558427 -1.360133 -0.16003
C  5.600038 1.482115 0.084234
C  5.826103 -1.035585 -0.178641
C  -0.741763 -0.415251 -0.035541
C  -1.718562 0.547963 0.066382
C  -3.146742 0.244292 0.058909
C  -4.120122 1.289673 0.165298
C  -4.90646 -1.292995 -0.052259
C  -5.854584 -0.245337 0.054539
H  3.172453 2.178324 0.17167
H  3.558206 -2.157637 -0.26342
H  0.733828 1.954018 0.180225
H  1.102996 -2.35413 -0.253176
H  5.315102 2.156053 -0.748873
H  6.695877 1.375277 0.072638
H  5.316451 1.975504 1.035807
H  6.885719 -0.736816 -0.159491
H  5.639748 -1.569308 -1.132511
H  5.658585 -1.751434 0.651469
H  -1.100705 -1.450507 -0.12663
H  -1.458577 1.610569 0.159417
H  -3.803708 2.335912 0.253181
H  -5.229938 -2.336629 -0.140222
H  -6.931413 -0.440746 0.053231
