program: Gaussian 09
title: 000231737
version: EM64L-G09RevD.01
frameworkgroup: C1[X(C11H10N4)]
method: RPBEPBE
basis: SDD
operation: Freq
keyword: #pfreq=noraman
keyword: PBEPBE/SDD
title: #p freq=noraman PBEPBE/SDD
converged: YES YES NO NO
title: Mulliken charges:
elementType: N N N N C C C C C C C C C C C H H H H H H H H H H
charge: -0.067672 -0.096751 0.021580 0.021556 0.391593 0.466863 0.009318 -0.522027 -0.376597 -0.346218 -0.766798 -0.798624 -0.136505 -0.127458 -0.127659 0.260061 0.237845 0.238127 0.250556 0.250832 0.215405 0.231035 0.235271 0.235356 0.300909
chargesum: 0.00000
title: Mulliken charges with hydrogens summed into heavy atoms:
elementType: N N N N C C C C C C C C C C C
charge: -0.067672 -0.096751 0.021580 0.021556 0.391593 0.466863 0.009318 -0.261965 -0.138751 -0.108090 -0.050005 -0.096962 0.164404 -0.127458 -0.127659
polarizability: 2.36030907e+02 -4.51498455e+00 1.28893417e+02 5.47589893e-02 1.07867036e-01 9.94193602e+01
1716.lowfreq: -3.5535 -0.0001 0.0003 0.0005 9.7298 10.6114 16.9346 42.4013 46.2298
frequency: 16.7174 42.3983 46.1182 81.7992 93.2292 112.7314 128.6873 197.3948 208.4963 268.3535 268.8115 300.4482 315.8105 332.2633 341.6758 364.0730 449.2154 453.8580 465.8756 505.9890 564.2326 570.7660 589.2327 661.8544 728.8505 730.4047 747.8006 834.6584 878.9191 908.2588 916.7863 949.1618 974.8049 1000.8377 1011.1593 1011.4844 1039.5726 1052.0406 1122.9115 1167.2862 1207.0379 1214.7865 1242.6058 1282.2703 1284.2049 1357.9430 1378.8032 1397.3884 1400.5913 1406.6793 1451.9821 1459.1700 1470.9515 1474.8220 1494.1726 1559.9943 1626.2115 2208.2540 2208.7141 2967.2876 2981.5670 2986.9371 3060.7194 3066.8513 3090.7474 3092.1627 3122.5094 3145.3747 3152.0031
redmass: 6.2879 1.0368 8.2685 6.1672 4.8547 11.4910 3.0769 6.7703 1.3836 4.3178 3.2899 3.7686 4.0544 4.3247 3.7461 8.2369 4.6017 3.3127 3.8805 6.7012 12.0976 9.9731 3.8435 6.0859 6.4599 2.9628 4.5123 1.2890 9.3568 4.2631 1.3679 3.1249 1.3659 1.8392 1.3639 3.6462 1.6100 1.5568 2.3813 1.4017 1.3581 2.5552 3.2220 1.4381 1.3600 4.5881 6.4145 2.7211 1.3530 1.3279 1.0454 1.1216 1.0449 1.1839 2.8865 5.1767 6.5207 12.6209 12.5761 1.0807 1.0375 1.0364 1.0977 1.0951 1.0990 1.1013 1.0876 1.0957 1.0929
irintensity: 0.6558 0.5276 0.0262 4.1724 0.1997 3.7072 2.5431 5.3827 0.2221 0.6192 3.6259 0.1014 9.1851 0.0418 4.2129 0.0177 0.1499 5.9344 9.1568 0.7847 4.0488 8.8221 8.3650 2.9323 2.0944 2.0010 1.9803 28.7801 9.4927 2.7321 6.2352 2.6303 0.2904 3.8793 8.1236 19.6004 4.1559 14.7046 16.3402 11.3930 0.8440 13.7504 27.6274 3.1066 2.3176 18.0211 119.0144 2.3452 8.5138 11.5555 13.7328 8.7463 14.4157 11.6592 42.8337 24.5114 3.1165 8.2592 0.1867 8.7488 31.3522 11.0990 17.4843 7.9081 12.0736 34.5604 7.6405 27.1718 5.5087
temp: 298.150 k
press: 1.00000 atm
elementType: 7 7 7 7 6 6 6 6 6 6 6 6 6 6 6 1 1 1 1 1 1 1 1 1 1
symmnumber: 1
zpe: 485969.2 jmol-1
zpe.correction: 0.185096 hartree
zpe.thermalcorrener: 0.200007 hartree
zpe.thermalcorrenthalpy: 0.200951 hartree
zpe.thermalcorrgfe: 0.141013 hartree
zpe.sumelectzpe: -643.025083 hartree
zpe.sumelectthermal: -643.010171 hartree
zpe.sumelectthermalent: -643.009227 hartree
zpe.sumelectthermalfe: -643.069166 hartree
dipole: 6.9214 -0.7641 -0.0186
dipole: 6.9634
quadrupole: -95.3810 -77.7095 -102.2944
quadrupole: 3.4030 0.0686 0.2541
quadrupole: -3.5860 14.0854 -10.4994 3.4030 0.0686 0.2541
hfenergy: -643.2101786 hartree
pointgroup: C01 [X(C11H10N4)]
dipole: -2.6699311 -0.6023962 0.1188875 debye
dipolederiv: 1.1017725 -0.0867488 -0.1720291 -0.0558223 -0.136537 0.0080089 -0.1601698 0.0112618 -0.1182755 -0.2744115 0.0214617 0.0120809 -0.6708905 -0.0499959 0.13136 -0.2118565 0.0511993 -0.1757888 -0.1728731 0.0258945 -0.0098909 -0.0665513 -0.160695 -0.0042739 0.0812579 -0.0420038 -0.1841374 -0.1907268 0.0229852 0.0304961 -0.006292 -0.1895766 0.0031402 -0.0993504 0.0267207 -0.1383697 0.2406408 0.3365827 0.0839648 -0.2302098 0.143099 0.0676316 -0.0986188 0.0024143 0.0305786 0.0367217 0.4239227 0.1287703 0.4519275 0.0772605 -0.0126786 0.1385559 -0.0083202 -0.0611704 -0.7404514 0.0587091 0.1101062 0.3390816 0.0063648 -0.0532964 0.1990733 -0.0208091 0.0195616 0.1822594 -0.2857085 -0.1271648 0.2130177 -0.0589209 -0.005073 0.0332606 0.0524161 -0.107488 -0.321884 -0.327048 -0.0871659 -0.1869795 -0.0138387 0.0687089 -0.0420635 0.084348 -0.1279484 0.1353151 -0.0238306 -0.0367649 -0.1025211 0.0704378 0.0738467 -0.0623863 0.0648219 -0.0942192 -0.0175616 -0.2817731 -0.0871161 -0.0827811 -0.0424077 -0.0115126 -0.0224039 0.011583 0.0285245 -0.0882388 -0.145252 -0.0300658 -0.0847111 -0.0036696 -0.0121955 -0.011288 -0.0059475 0.0623732 0.2288045 0.0066971 0.0258067 -0.0357308 0.3836782 -0.0092862 0.0132846 -0.0141019 0.4190912 -0.1624269 0.0061562 -0.0294119 0.2094383 -0.0276189 -0.0449649 -0.1518017 -0.0236857 -0.0093497 -0.1005352 -0.0170206 0.0523362 0.0782873 -0.0494195 -0.0009064 0.2700461 0.012812 -0.0475879 0.1069744 0.0460396 0.0194219 0.0248123 -0.0204801 -0.0571439 0.0126893 -0.0597639 0.1268919 0.0488133 0.0276189 0.0199433 0.0782949 -0.0737543 -0.0799091 0.0362123 -0.0742147 0.117373 -0.1129189 0.0147706 0.0339566 0.0130716 0.1002387 -0.0157388 0.03327 -0.0159218 0.1354179 0.0105891 0.0195428 -0.0888989 0.0347154 0.0370633 0.0393655 -0.0956127 0.0034699 0.0214609 0.0512239 -0.0325808 0.0751185 -0.0317163 0.0479103 -0.0053108 0.0870494 0.0322441 -0.0293526 -0.010718 0.1664373 0.0674572 0.0630274 -0.0713907 -0.0647578 0.0337481 -0.0766612 0.0765467 0.0367065 0.1308709 0.0504208 0.0148046 -0.064441 -0.0580654 0.0131613 -0.0711596 0.0863249 0.0167784 -0.0725099 0.0805011 -0.071418 0.0416839 0.0019143 0.1149248 0.0611092 -0.0510224 -0.0335631 -0.0147454 -0.1144286 0.0176715 0.0396946 0.0535884 -0.1381053 -0.0017895 0.0012026 0.0297096 -0.0204715 -0.0074435 0.0874738 0.0153149 -0.0124511 0.0271235 -0.0000213 0.0193632 unknown
polarizability: 232.8393264|17.4991478|128.4918628|-9.6799602|7.5293528|103.0124958 unknown
InChI: InChI=1S/C11H10N4/c1-8-3-4-9(2)11(5-8)15-14-10(6-12)7-13/h3-5,10H,1-2H3
charge 0 multiplicity 1
25 atoms
N  0.426936 -0.467192 -0.331778
N  1.370968 0.409819 -0.159996
N  3.76282 1.104605 -2.582329
N  4.266182 -0.243144 1.646265
C  -1.376663 1.207285 0.416735
C  -3.221466 -0.987829 -0.083797
C  -0.917435 -0.073162 -0.049718
C  -1.836771 -1.136964 -0.28881
C  -2.773534 1.336563 0.61714
C  -3.675137 0.277555 0.376811
C  -0.472139 2.386896 0.696333
C  -4.194277 -2.123427 -0.342433
C  2.721708 -0.247498 -0.530276
C  3.318046 0.503707 -1.654554
C  3.59447 -0.235073 0.662189
H  -1.41872 -2.085479 -0.643089
H  -3.161194 2.298369 0.972199
H  -4.747011 0.435419 0.549211
H  0.290864 2.142144 1.456924
H  0.100942 2.681065 -0.2012
H  -1.06384 3.250699 1.04497
H  -3.673933 -3.030385 -0.693239
H  -4.753803 -2.388777 0.573882
H  -4.940177 -1.844665 -1.109894
H  2.541967 -1.298229 -0.844147
