program: Gaussian 09
title: 000231736
version: EM64L-G09RevD.01
frameworkgroup: C1[X(C10H8N4O3)]
method: RPBEPBE
basis: SDD
operation: Freq
keyword: #p
keyword: freq=noraman
keyword: PBEPBE/SDD
title: #p freq=noraman PBEPBE/SDD
converged: YES YES NO NO
title: Mulliken charges:
elementType: O O O N N N N C C C C C C C C C C H H H H H H H H
charge: -0.425566 -0.271000 -0.215425 -0.101440 -0.058657 -0.640150 0.006626 0.113315 0.154786 -0.300261 -0.302245 -0.199744 -0.224111 -0.250700 0.148990 0.214108 -0.139511 0.274804 0.280574 0.245252 0.244542 0.296481 0.423186 0.334205 0.391940
chargesum: 0.00000
title: Mulliken charges with hydrogens summed into heavy atoms:
elementType: O O O N N N N C C C C C C C C C C
charge: -0.033626 -0.271000 -0.215425 -0.101440 -0.058657 0.117241 0.006626 0.113315 0.154786 -0.025457 -0.021671 0.045508 0.020431 0.045780 0.148990 0.214108 -0.139511
polarizability: 2.50422642e+02 6.55529281e+00 1.67261482e+02 4.55665118e-01 3.83881333e+00 6.78526733e+01
1716.lowfreq: -8.1046 -5.1577 -3.1617 0.0004 0.0007 0.0011 29.5476 54.3065 81.3176
frequency: 29.5366 54.2927 81.3157 83.3863 88.7832 111.5961 135.2462 148.5414 193.9487 222.2131 274.3205 282.2492 316.9396 355.2818 376.2049 410.4408 432.0966 442.5044 501.7979 523.5786 537.9361 575.9638 594.8118 604.5405 614.3002 633.8581 683.5161 688.1428 736.3972 777.5410 787.1719 807.6147 834.3126 843.9033 894.6932 953.1962 976.1653 1002.9923 1013.9944 1021.2838 1038.0610 1077.8017 1108.1939 1160.6046 1178.4883 1186.7753 1197.2760 1268.9094 1279.3155 1307.3161 1328.7753 1388.8088 1399.1846 1428.3676 1469.6227 1576.1436 1591.8404 1615.3837 1625.2771 1675.7410 2222.7640 2973.1250 3144.1498 3159.2301 3171.2602 3184.7000 3365.7387 3528.6127 3609.0740
redmass: 8.5059 8.6356 9.6768 6.0729 8.4537 7.4194 5.4341 8.8051 7.0668 6.3500 8.9465 7.4099 6.1285 8.1508 8.5237 3.7613 5.2747 4.5014 6.5713 2.6736 4.3005 7.8769 1.4338 3.1137 2.7715 2.6853 3.5192 3.0317 3.9331 3.4320 1.6904 5.2929 1.1329 6.2039 1.4814 7.3076 1.4289 1.3595 5.0849 3.2320 2.2502 1.8788 1.9092 1.6380 1.1303 1.7021 1.7145 1.5388 1.5751 3.5928 2.7594 9.4738 9.3658 2.3640 2.5721 6.9803 6.2487 3.0286 2.0584 3.6408 12.5803 1.0809 1.0867 1.0908 1.0964 1.0983 1.0617 1.0643 1.0914
irintensity: 0.7608 1.2154 2.0422 1.9809 4.3969 2.8201 0.6094 2.0429 3.6568 0.1176 2.1306 3.3932 5.9527 3.8877 4.0582 9.5349 3.1200 5.8164 14.4766 14.3445 18.4383 3.0057 72.0830 67.9520 38.6412 23.3246 76.5758 26.4465 48.0553 23.9520 42.9748 5.2981 210.9916 9.9831 9.4059 65.7937 4.0128 3.6241 204.0964 49.6235 13.3741 17.4709 64.3368 93.8581 3.2349 6.6844 30.3950 1.8172 28.5625 160.3222 116.7090 9.7390 2.8422 3.2176 32.0085 25.4511 45.7271 110.6654 218.7101 235.6549 1.1219 3.3730 2.6195 6.1114 6.4071 8.8535 340.0907 63.9836 88.2976
temp: 298.150 k
press: 1.00000 atm
elementType: 8 8 8 7 7 7 7 6 6 6 6 6 6 6 6 6 6 1 1 1 1 1 1 1 1
symmnumber: 1
zpe: 454025.6 jmol-1
zpe.correction: 0.172929 hartree
zpe.thermalcorrener: 0.188339 hartree
zpe.thermalcorrenthalpy: 0.189283 hartree
zpe.thermalcorrgfe: 0.129145 hartree
zpe.sumelectzpe: -829.292026 hartree
zpe.sumelectthermal: -829.276616 hartree
zpe.sumelectthermalent: -829.275672 hartree
zpe.sumelectthermalfe: -829.335810 hartree
dipole: -9.4802 2.1908 0.7833
dipole: 9.7615
quadrupole: -118.8391 -84.3339 -98.3918
quadrupole: 10.3593 6.5399 1.3231
quadrupole: -18.3176 16.1877 2.1298 10.3593 6.5399 1.3231
hfenergy: -829.4649549 hartree
pointgroup: C01 [X(C10H8N4O3)]
dipole: 3.4971474 1.5655857 -0.2612576 debye
dipolederiv: -0.7473976 -0.6132133 0.153981 -0.6157648 -0.9945742 0.1832445 0.1736642 0.2247558 -0.4736545 -1.0534856 0.0926793 0.0906157 0.1284529 -0.7884872 0.0757098 0.0490464 0.0965691 -0.3240513 -1.2127045 -0.1297605 0.1482809 0.1640556 -0.5106735 -0.073062 0.4124492 -0.0290491 -0.4029335 -0.3669007 0.0431934 0.029105 0.0178798 -0.0087186 0.0375846 0.0906702 -0.0773128 -0.1450819 0.7064437 -0.1389671 -0.0629444 -0.2885256 -0.2498896 -0.1103067 0.3102256 0.0011074 -0.0841431 -0.6554189 -0.2279001 -0.0791289 -0.1986145 -0.8947108 0.0598968 -0.0754541 0.0082732 -0.5679827 -0.1776214 0.0169386 -0.023173 -0.0288298 -0.200211 -0.0299856 -0.0046516 -0.0083384 -0.2078766 0.2707383 0.1102586 0.0189002 -0.1684053 0.2277731 -0.0292305 0.0246511 -0.039632 0.058752 0.0055828 0.2439707 -0.0170426 0.0671474 -0.6147808 0.1018758 -0.1161862 0.1526288 -0.0476998 -0.2779619 0.143333 -0.0321063 0.1663975 -0.0683009 0.040028 0.0758712 0.0391482 -0.1010185 -0.1444825 -0.1545215 0.0340079 0.2404447 0.1312872 -0.0045383 -0.0360223 -0.0434951 -0.0925708 0.1258833 -0.0571422 0.0526289 -0.0432843 0.1769494 -0.0487308 0.0793472 -0.0590474 -0.08517 0.0754727 -0.0494051 0.0564711 -0.2019856 -0.2251985 -0.0134847 0.0612221 0.0247542 -0.1376139 -0.3276445 0.3012209 0.1713893 0.7978787 0.0184212 -0.1274285 0.1150266 -0.1054718 0.2790449 1.3571055 0.1229771 -0.2121139 0.2479594 1.8177959 -0.3252112 -0.2033746 -0.3832439 0.3514463 1.3374196 0.1959641 -0.2929884 -0.4007427 1.1902293 0.2575332 -0.7026678 0.2670685 0.3884297 -0.0782098 0.0370357 0.0036982 0.0543299 0.0628955 0.0213404 -0.0810214 0.0154848 -0.0390853 0.0715486 -0.0761593 -0.025538 -0.0516704 0.0481098 0.0034914 -0.0672349 0.0104042 0.1448207 0.054321 -0.0493712 -0.0100872 -0.059764 0.0465491 -0.000509 0.0180146 -0.0149803 0.1613327 0.0574823 0.0562128 -0.0262543 0.0755162 -0.0527296 0.0427214 -0.0459494 0.0232081 0.1424079 -0.0835967 0.031312 -0.0478405 0.0187416 0.0862057 0.0131544 -0.0555354 0.015904 0.1509949 0.0263954 -0.0498618 0.0132987 -0.0779662 0.0426077 0.0492867 -0.0785223 0.0066778 -0.003364 0.6258797 0.0193573 0.0093885 0.0457386 0.249298 -0.063615 -0.0160496 -0.0459749 0.3140252 0.1740452 -0.0402297 0.0559185 -0.0194607 0.2071254 -0.0622387 0.0829819 -0.0489867 0.3181047 0.2371059 0.1720783 -0.0084664 0.1304717 0.3030271 0.0024738 -0.0105007 -0.0304515 0.4028868 unknown
polarizability: 249.5049644|10.2684002|167.5056451|6.4665987|-7.2972446|68.5261878 unknown
InChI: InChI=1S/C10H8N4O3/c11-5-8(9(12)15)14-13-7-4-2-1-3-6(7)10(16)17/h1-4,8,16H,12H2
charge 0 multiplicity 1
25 atoms
O  2.464999 2.92763 -0.694698
O  0.253031 2.388344 -0.318072
O  -4.434138 0.285666 0.459067
N  -0.257431 -0.287615 -0.648888
N  -1.150867 -1.043781 -0.086501
N  -2.486762 1.542113 0.17848
N  -3.915952 -3.033126 -0.607856
C  1.085918 -0.481864 -0.191911
C  1.973295 0.63952 -0.183328
C  1.579634 -1.777046 0.107572
C  3.347157 0.433319 0.100709
C  2.94479 -1.961032 0.401909
C  3.832934 -0.858096 0.390752
C  -2.504249 -0.780716 -0.685945
C  1.452015 2.012182 -0.396533
C  -3.244253 0.408698 0.068675
C  -3.29872 -2.015105 -0.627153
H  0.881186 -2.619585 0.085773
H  4.017371 1.296759 0.104341
H  3.31934 -2.963628 0.633802
H  4.89484 -1.00518 0.611118
H  -2.400894 -0.442397 -1.738991
H  -1.506885 1.627127 -0.130547
H  -2.922667 2.347673 0.627979
H  2.065012 3.832441 -0.801053
