program: Gaussian 09
title: 000231744
version: EM64L-G09RevD.01
frameworkgroup: C1[X(C20H13BrO3)]
method: RPBEPBE
basis: SDD
operation: Freq
keyword: #p
keyword: freq=noraman
keyword: PBEPBE/SDD
title: #p freq=noraman PBEPBE/SDD
converged: YES YES NO NO
title: Mulliken charges:
elementType: Br O O O C C C C C C C C C C C C C C C C C C C C H H H H H H H H H H H H H
charge: 0.002028 -0.279774 -0.271064 -0.183223 -0.025685 0.388655 0.397326 0.027880 0.098714 -0.365307 -0.357345 -0.350866 -0.379322 -0.214954 0.380425 -0.216465 -0.236155 -0.215765 -0.234414 -0.396927 -0.279242 -0.153432 -0.173170 -0.238893 0.254735 0.270741 0.253106 0.265076 0.236394 0.240372 0.231744 0.232292 0.233853 0.258761 0.298218 0.251622 0.250063
chargesum: 0.00000
title: Mulliken charges with hydrogens summed into heavy atoms:
elementType: Br O O O C C C C C C C C C C C C C C C C C C C C
charge: 0.002028 -0.279774 -0.271064 -0.183223 -0.025685 0.388655 0.397326 0.027880 0.098714 -0.110572 -0.086605 -0.097760 -0.114246 0.021439 0.380425 0.023907 -0.004412 0.016527 -0.000561 -0.138166 0.018976 0.098190 0.076894 -0.238893
polarizability: 3.02398226e+02 -2.85190269e+01 1.92641922e+02 -3.30515974e+00 -3.69960486e+00 2.14088010e+02
1716.lowfreq: -4.1094 -0.0004 0.0006 0.0007 4.1516 6.0894 20.6172 39.0542 44.1877
frequency: 20.4900 39.0477 44.1737 47.5862 49.5522 65.4146 94.3293 128.6676 132.8158 185.7556 199.8366 216.2287 242.8434 282.8069 286.4829 300.2267 324.6088 347.2807 370.7024 403.1595 411.8622 413.5031 477.4732 496.3174 503.9868 517.8856 557.1102 575.6337 609.4565 614.4962 630.7297 657.9153 664.8436 671.8026 696.3809 705.3015 713.6907 751.1515 767.1681 772.3151 787.2530 816.0531 816.6057 826.4421 840.3862 860.3426 891.5833 932.8577 944.5491 948.1070 961.7677 967.0414 977.7616 986.8158 990.1211 991.3229 1000.9883 1003.3915 1005.4426 1029.7266 1034.6779 1060.0503 1085.5550 1097.5889 1111.1733 1169.6555 1172.9464 1175.0161 1175.7159 1188.2848 1194.8330 1215.1384 1258.8676 1280.2422 1293.1783 1314.9637 1368.0253 1381.7918 1397.7616 1407.0256 1435.5439 1451.6140 1461.8569 1465.9796 1480.1331 1583.7467 1592.1958 1595.1712 1610.9764 1612.4362 1618.2211 1716.1737 3130.0977 3139.1565 3139.5374 3151.4138 3152.5988 3156.6220 3161.9906 3164.3843 3165.8060 3172.8507 3174.7606 3177.0932 3196.6635
redmass: 8.0960 4.2884 4.9323 6.5051 4.3818 6.1618 7.7785 7.1264 5.8867 8.9046 6.5224 6.1964 6.2108 6.2686 6.5598 6.2077 6.4667 6.9957 8.2387 2.8591 2.9874 3.2722 4.0700 3.6432 3.8000 6.0843 8.3327 8.6888 6.3347 6.4400 6.4728 7.9239 5.1319 6.1355 3.7960 1.9932 5.3473 2.6389 2.1408 7.4215 1.7857 1.5418 2.6915 1.6677 5.5159 1.2636 1.4222 1.5292 1.9028 2.3463 1.3805 1.5165 5.5428 1.4981 5.4187 4.5389 1.8696 1.3429 2.2776 2.1670 2.4627 2.3981 1.7815 1.9456 1.3365 1.6563 1.4705 1.3153 1.2240 1.2240 1.6329 3.5643 4.0238 1.4870 1.2744 1.3296 7.1736 8.8965 3.4359 8.0419 2.2114 2.4612 2.5148 2.3588 2.2643 7.1657 6.4514 6.7158 6.2148 7.6597 7.2663 12.9503 1.0851 1.0874 1.0874 1.0930 1.0906 1.0885 1.0962 1.0956 1.0907 1.1000 1.1005 1.0972 1.0951
irintensity: 0.6291 0.1015 0.3092 2.0280 0.0663 0.5097 0.8591 0.8297 0.5589 0.0625 0.6895 0.2948 2.2787 4.4977 4.2684 1.8634 0.9837 0.9600 10.6257 0.1013 0.1010 1.5119 5.2741 3.0607 18.0935 15.8595 4.5898 15.2300 11.8047 1.3803 7.6706 5.3437 26.0652 10.6818 1.0018 52.8951 4.4851 24.9738 55.4568 29.3763 39.4951 1.9046 13.5208 179.5515 374.5088 7.0091 1.0664 47.3349 7.8108 15.5121 1.4459 14.7370 100.1497 15.4299 0.5141 48.3447 67.0623 0.2731 72.3155 16.1132 78.5290 14.3893 5.2420 9.1472 13.7413 131.7980 53.0769 13.0837 14.5385 25.6004 118.1132 61.6098 107.2056 2.4216 3.9152 2.2292 10.5741 0.6456 2.1742 1.5638 15.0904 27.6079 31.3506 188.8481 9.3160 16.0230 2.0516 7.1352 1.3095 7.3425 15.4042 388.4394 0.2923 0.9573 5.6034 21.6659 5.7234 3.3534 14.2579 12.0049 2.9028 13.2782 18.1115 3.5032 0.3638
temp: 298.150 k
press: 1.00000 atm
elementType: 35 8 8 8 6 6 6 6 6 6 6 6 6 6 6 6 6 6 6 6 6 6 6 6 1 1 1 1 1 1 1 1 1 1 1 1 1
symmnumber: 1
zpe: 709739.1 jmol-1
zpe.correction: 0.270325 hartree
zpe.thermalcorrener: 0.289903 hartree
zpe.thermalcorrenthalpy: 0.290847 hartree
zpe.thermalcorrgfe: 0.219490 hartree
zpe.sumelectzpe: -1007.422785 hartree
zpe.sumelectthermal: -1007.403208 hartree
zpe.sumelectthermalent: -1007.402263 hartree
zpe.sumelectthermalfe: -1007.473620 hartree
dipole: 3.9967 3.0586 -4.0565
dipole: 6.4640
quadrupole: -139.3135 -142.5585 -142.3596
quadrupole: -1.4786 -9.7960 8.7934
quadrupole: 2.0970 -1.1480 -0.9490 -1.4786 -9.7960 8.7934
hfenergy: -1007.6931102 hartree
pointgroup: C01 [X(C20H13Br1O3)]
dipole: -1.8513589 -1.3303091 -1.127102 debye
polarizability: 294.9467926|-39.0283308|204.1684123|4.3766534|9.9157069|210.0129531 unknown
InChI: InChI=1S/C20H13BrO3/c21-15-10-12-16(13-11-15)23-20(14-6-2-1-3-7-14)18-9-5-4-8-17(18)19(22)24-20/h1-13H
charge 0 multiplicity 1
37 atoms
Br 6.456422 -0.264946 -0.562347
O  -0.386022 1.151498 1.249355
O  0.346042 0.584572 -0.991906
O  -1.445907 2.978624 2.26211
C  -0.614889 0.268184 0.0612
C  -1.970573 0.735199 -0.473608
C  -0.561767 -1.196191 0.495971
C  -2.430071 1.818982 0.299114
C  -1.449036 2.118475 1.371065
C  -2.719809 0.253071 -1.557408
C  -3.652014 2.462906 0.024428
C  -0.29481 -2.196508 -0.471868
C  -0.849627 -1.570121 1.829832
C  -3.951145 0.892556 -1.845586
C  1.736509 0.361051 -0.790897
C  -4.414432 1.984199 -1.064631
C  -0.30938 -3.558786 -0.104592
C  -0.865609 -2.934898 2.193469
C  -0.597771 -3.932773 1.22849
C  2.498548 0.336997 -1.980621
C  2.358488 0.220341 0.470297
C  3.896284 0.156274 -1.918554
C  3.757345 0.030292 0.531501
C  4.510633 -0.002057 -0.658466
H  -2.370169 -0.589544 -2.161231
H  -3.987191 3.303403 0.640216
H  -0.053399 -1.906482 -1.50018
H  -1.039612 -0.796055 2.57938
H  -4.558449 0.538113 -2.685509
H  -5.37134 2.456048 -1.311084
H  -0.090493 -4.326198 -0.855009
H  -1.082137 -3.217571 3.229442
H  -0.607207 -4.990579 1.513394
H  1.993175 0.464387 -2.942572
H  1.778391 0.280798 1.392842
H  4.490237 0.137852 -2.836579
H  4.247087 -0.080106 1.503041
