program: Gaussian 09
title: 000231782
version: EM64L-G09RevD.01
frameworkgroup: C1[X(C25H19BrO)]
method: RPBEPBE
basis: SDD
operation: Freq
keyword: #p
keyword: freq=noraman
keyword: PBEPBE/SDD
title: #p freq=noraman PBEPBE/SDD
converged: YES YES NO NO
title: Mulliken charges:
elementType: Br O C C C C C C C C C C C C C C C C C C C C C C C C C H H H H H H H H H H H H H H H H H H H
charge: -0.000007 -0.216944 -0.347653 0.370141 -0.634465 0.509736 0.147339 0.398800 -0.399116 0.154545 -0.404752 -0.401396 -0.393650 -0.476388 -0.259485 -0.438809 0.283597 -0.277046 -0.194893 -0.205177 -0.244819 -0.223786 -0.343672 -0.348303 -0.248073 -0.228378 -0.222834 0.248192 0.240721 0.283918 0.254649 0.243600 0.231976 0.253089 0.239896 0.227648 0.238872 0.229650 0.249057 0.247941 0.229928 0.244590 0.279062 0.232331 0.235287 0.235080
chargesum: 0.00000
title: Mulliken charges with hydrogens summed into heavy atoms:
elementType: Br O C C C C C C C C C C C C C C C C C C C C C C C C C
charge: -0.000007 -0.216944 -0.099461 0.370141 -0.109826 0.509736 0.147339 0.398800 -0.144467 0.154545 -0.161152 -0.169420 -0.140561 -0.236492 -0.031838 -0.199936 0.283597 -0.047397 0.054164 0.042764 -0.014891 -0.223786 -0.099082 -0.069241 -0.015741 0.006909 0.012247
polarizability: 3.50470785e+02 1.77408595e+01 2.96153174e+02 1.63591133e+01 -3.53355549e+00 2.30660339e+02
1716.lowfreq: -6.1433 -0.0008 -0.0006 -0.0004 2.6567 3.3509 7.5288 10.5945 22.9391
frequency: -1.3291 10.0752 22.8687 28.4142 35.5912 45.1435 57.1606 109.5781 122.0798 134.1896 147.8788 158.3848 174.6734 187.3922 215.7803 250.1926 277.6155 300.2968 316.7970 342.9817 399.3491 404.8412 409.7840 415.2434 422.6859 439.6838 471.9818 482.5077 504.1566 510.4445 521.1769 562.5630 581.4652 608.8570 613.5623 624.0965 639.4797 653.2297 658.1457 696.5654 702.1814 738.6998 747.6757 759.4097 775.5499 785.9399 790.5827 806.6985 817.6239 830.4545 841.8007 858.8594 873.8688 886.3796 926.8775 932.9136 953.5745 962.4374 963.2658 970.4608 977.0827 988.2754 989.6071 991.2487 994.4006 995.3192 1010.7966 1015.2874 1026.3382 1034.4821 1058.0530 1067.8334 1084.0161 1087.9864 1116.3817 1149.8748 1170.6413 1174.1445 1175.8309 1182.8606 1189.4078 1193.9499 1201.2823 1221.0666 1233.8487 1245.8442 1247.3539 1278.3364 1295.9888 1309.5732 1325.2391 1341.9667 1371.6280 1381.6326 1387.6168 1398.3413 1406.8806 1419.9033 1435.3962 1439.6936 1446.5670 1456.0541 1475.3376 1479.9169 1517.0523 1568.0656 1581.1660 1588.9853 1596.4208 1597.7357 1599.9259 1611.9175 1631.5553 2981.1819 3010.4156 3049.0550 3120.8828 3123.3104 3129.9670 3131.7547 3132.9861 3136.5857 3139.4399 3139.9498 3147.0756 3150.3505 3158.5609 3159.9895 3163.4046 3166.8705 3170.3446 3170.5112
redmass: 4.1646 6.7063 5.1083 5.2077 6.7020 4.8680 7.1477 5.4960 5.5335 6.4128 6.7804 6.4884 4.2521 5.0560 3.7985 4.4943 5.1421 4.7674 5.9064 4.8723 2.8117 2.8679 3.7069 3.2542 3.6577 5.8564 3.2936 4.2481 4.6149 4.8364 4.6998 2.6874 3.3057 4.9245 6.3564 6.4021 5.1003 4.5809 4.3774 1.8075 4.5878 3.6452 1.2932 2.2803 2.9210 3.1634 2.8736 2.2121 1.6316 1.2843 2.2833 1.2499 2.0637 2.3711 1.4498 1.6259 1.4116 1.9201 1.5151 1.4199 3.7052 1.3719 4.5652 1.4907 1.3692 4.8656 1.4371 3.5862 2.1193 2.2646 3.2090 2.4117 2.0726 1.7327 1.4196 1.4307 1.2116 1.0816 1.1332 1.2704 1.1535 1.1190 2.0146 1.7854 1.9358 1.9169 2.0808 1.6905 1.2845 1.5178 1.6471 1.8796 2.5430 3.4502 9.0906 2.0878 2.9013 4.0585 2.2214 2.3323 1.1501 2.4467 2.3353 2.1634 3.6742 7.0688 6.9271 7.5116 6.4425 6.4016 5.2490 6.4172 6.4636 1.0651 1.0816 1.0928 1.0865 1.0861 1.0851 1.0877 1.0896 1.0883 1.0880 1.0912 1.0944 1.0925 1.0985 1.0961 1.1003 1.0951 1.0962 1.1012
irintensity: 0.0652 0.8499 0.5222 0.0602 0.1360 0.2554 2.4285 0.6788 0.1785 0.2791 0.2017 0.0722 2.4222 0.2751 6.0683 2.9509 10.1353 2.2266 1.8077 2.8002 0.0774 0.1263 5.7751 1.1252 10.7763 0.4531 0.1810 4.2240 6.8825 19.5960 13.0287 2.7997 6.6996 16.1680 2.8283 1.7741 8.9957 11.1896 9.3720 48.8176 0.6223 9.1369 8.9761 14.4139 35.0014 27.8976 49.6313 37.8947 47.0603 0.5903 21.0278 0.6111 0.2042 5.6127 2.0634 16.1917 0.2631 11.0547 11.2571 2.7027 43.4221 3.2967 6.9754 0.4953 3.3690 59.5588 0.1382 2.7327 1.7642 6.6364 10.9407 28.2120 2.8864 14.9818 8.0248 0.8287 2.6977 3.6431 1.4500 0.9807 37.8426 1.0579 18.4418 7.3197 26.7537 2.6404 118.1441 38.1876 2.6591 22.9366 64.3789 13.9783 6.8845 6.3998 2.4962 15.1341 2.3725 3.4528 25.2713 6.2442 39.6004 3.0080 80.7216 3.3269 11.2165 88.3835 2.6305 4.7220 24.8557 19.3469 7.4690 10.4011 1.3102 22.7971 3.5841 11.6649 1.6995 2.4214 0.3586 3.2684 6.7191 16.5189 5.3553 14.7625 40.2683 18.4248 29.4041 18.1209 25.1332 10.6743 0.8743 23.3037
temp: 298.150 k
press: 1.00000 atm
elementType: 35 8 6 6 6 6 6 6 6 6 6 6 6 6 6 6 6 6 6 6 6 6 6 6 6 6 6 1 1 1 1 1 1 1 1 1 1 1 1 1 1 1 1 1 1 1
symmnumber: 1
zpe: 942842.2 jmol-1
zpe.correction: 0.359110 hartree
zpe.thermalcorrener: 0.380839 hartree
zpe.thermalcorrenthalpy: 0.381783 hartree
zpe.thermalcorrgfe: 0.304324 hartree
zpe.sumelectzpe: -1050.912381 hartree
zpe.sumelectthermal: -1050.890651 hartree
zpe.sumelectthermalent: -1050.889707 hartree
zpe.sumelectthermalfe: -1050.967166 hartree
dipole: -3.5043 1.6577 2.5089
dipole: 4.6177
quadrupole: -169.1908 -144.5344 -160.8561
quadrupole: 2.0810 -0.5275 5.3169
quadrupole: -10.9970 13.6593 -2.6623 2.0810 -0.5275 5.3169
hfenergy: -1051.2714903 hartree
pointgroup: C01 [X(C25H19Br1O1)]
dipole: -0.1358854 1.6903209 -0.6518021 debye
polarizability: 316.7917461|32.6045784|320.1021503|4.1376159|32.8637795|240.3904023 unknown
InChI: InChI=1S/C25H19BrO/c26-21-15-13-19(14-16-21)24(17-25(27)20-8-2-1-3-9-20)23-12-6-10-18-7-4-5-11-22(18)23/h1-16,24H,17H2
charge 0 multiplicity 1
46 atoms
Br -1.469173 -6.330678 -1.184974
O  -1.713203 0.006249 2.007991
C  0.439103 -0.459328 0.233128
C  1.777197 -0.119442 -0.450566
C  -0.585581 0.674014 -0.043469
C  -0.077148 -1.857098 -0.127828
C  2.67195 0.853246 0.14699
C  3.900504 1.201349 -0.545104
C  2.129066 -0.702027 -1.674735
C  -1.780242 0.650847 0.919608
C  0.445998 -2.973182 0.574056
C  -1.025724 -2.1035 -1.150274
C  2.405027 1.496531 1.405168
C  4.210226 0.579469 -1.799324
C  3.339665 -0.358191 -2.351352
C  4.791901 2.162757 0.037111
C  -3.009665 1.443373 0.575354
C  3.293198 2.429009 1.947844
C  0.046978 -4.292759 0.273735
C  -1.444356 -3.417086 -1.468318
C  4.49846 2.770071 1.258691
C  -0.898408 -4.498721 -0.752202
C  -3.077211 2.298898 -0.557968
C  -4.140145 1.339054 1.432019
C  -4.25158 3.033785 -0.82759
C  -5.314097 2.06686 1.158163
C  -5.372821 2.91699 0.026558
H  0.594479 -0.471925 1.328767
H  -0.923373 0.652684 -1.094551
H  -0.082952 1.655185 0.082343
H  1.46759 -1.450914 -2.12215
H  1.177203 -2.8097 1.374488
H  -1.464281 -1.275708 -1.717761
H  1.496439 1.249349 1.963845
H  5.141683 0.850318 -2.310548
H  3.576768 -0.840201 -3.306075
H  5.716014 2.411914 -0.498427
H  3.068063 2.900193 2.910966
H  0.459496 -5.139135 0.830192
H  -2.181411 -3.587803 -2.258312
H  5.186774 3.502391 1.694487
H  -2.215745 2.40584 -1.225475
H  -4.066726 0.67911 2.302797
H  -4.294195 3.695556 -1.699432
H  -6.181975 1.976053 1.820259
H  -6.285469 3.484707 -0.186725
