program: Gaussian 09
title: 000231705
version: EM64L-G09RevD.01
frameworkgroup: C1[X(C12H10N4)]
method: RPBEPBE
basis: SDD
operation: Freq
keyword: #pfreq=noraman
keyword: PBEPBE/SDD
title: #p freq=noraman PBEPBE/SDD
converged: YES YES NO NO
title: Mulliken charges:
elementType: N N N N C C C C C C C C C C C C H H H H H H H H H H
charge: -0.307319 -0.056566 -0.110789 -0.709202 0.272832 -0.030071 0.437773 -0.258121 -0.507854 0.570930 -0.428633 -0.367561 -0.371997 -0.220613 -0.207045 -0.246409 0.242755 0.246986 0.218104 0.242363 0.278906 0.228622 0.231799 0.231943 0.311088 0.308078
chargesum: 0.00000
title: Mulliken charges with hydrogens summed into heavy atoms:
elementType: N N N N C C C C C C C C C C C C
charge: -0.307319 -0.056566 -0.110789 -0.090035 0.272832 -0.030071 0.437773 -0.015366 -0.260869 0.570930 -0.210529 -0.125198 -0.093091 0.008009 0.024755 -0.014466
polarizability: 2.70736715e+02 -1.36680090e+00 1.60421817e+02 -3.91656770e+00 3.71654890e+00 6.76430100e+01
1716.lowfreq: -9.9312 -5.9991 -0.0001 0.0003 0.0005 4.1462 44.2247 63.7419 96.6006
frequency: 44.2010 63.7351 96.5943 150.5669 211.7918 245.4830 292.1437 300.2145 330.7146 358.5509 377.3204 396.8585 407.0774 428.4849 468.8720 498.3554 529.9222 598.8271 612.6600 617.0158 645.9299 676.5689 695.8413 736.0148 751.6920 763.1374 804.7557 840.8228 843.2193 856.3489 903.6301 920.8074 930.0593 936.7886 972.9516 979.9035 988.0313 993.7332 1026.9927 1037.9574 1087.7537 1131.7119 1155.8762 1173.4436 1180.1762 1193.9971 1224.1549 1274.0202 1314.9727 1328.9475 1382.1555 1385.8226 1410.8225 1447.0144 1460.9246 1490.0401 1503.4000 1580.4715 1596.7975 1611.7797 1639.2330 1649.6533 3127.1629 3132.2849 3142.8162 3159.3288 3160.0395 3169.6779 3175.7238 3182.5691 3570.5162 3710.2448
redmass: 4.3052 4.4945 4.9692 5.4137 5.1993 5.0983 5.7769 4.3402 1.1393 2.5147 1.6610 3.3916 2.8906 2.8702 5.6442 4.6855 4.8571 4.7196 5.6751 6.1175 4.8649 6.4519 2.0545 4.6039 6.2256 1.7112 1.4909 1.4991 3.4429 1.6687 2.7883 2.1829 1.7739 1.8857 1.4127 7.7036 5.3006 1.3514 2.0514 1.4051 1.5460 2.5528 2.2080 1.0523 1.3254 1.4503 8.5048 1.7956 1.7126 1.6078 6.0999 5.6383 3.8529 2.5666 4.6316 2.7542 4.6920 7.3436 7.0074 6.0994 1.5612 2.7654 1.0891 1.0853 1.0898 1.0931 1.0937 1.0974 1.0946 1.0975 1.0450 1.1041
irintensity: 2.8011 0.3840 1.6054 1.4074 0.5940 0.8527 1.5432 3.8143 144.4684 57.4229 104.7903 21.7395 0.5536 3.0250 0.8919 4.5901 8.4291 12.6876 6.0007 7.9770 1.8982 5.5821 39.5556 1.5197 3.3546 73.0905 36.1126 8.4129 32.9845 44.9613 57.9354 42.0478 1.4118 3.2646 0.4019 38.8115 0.1487 1.3767 6.5236 5.1607 15.8251 34.7551 22.8680 0.1158 15.1589 26.8380 61.8464 21.8160 28.7519 17.1076 10.8627 0.9662 15.5590 10.7982 71.9579 57.4569 186.5962 49.0125 14.4639 66.7741 14.1322 288.7739 17.0474 1.3189 14.9074 38.4568 8.6234 4.5364 13.1130 2.9726 94.7736 22.7778
temp: 298.150 k
press: 1.00000 atm
elementType: 7 7 7 7 6 6 6 6 6 6 6 6 6 6 6 6 1 1 1 1 1 1 1 1 1 1
symmnumber: 1
zpe: 520902.6 jmol-1
zpe.correction: 0.198401 hartree
zpe.thermalcorrener: 0.210843 hartree
zpe.thermalcorrenthalpy: 0.211787 hartree
zpe.thermalcorrgfe: 0.159424 hartree
zpe.sumelectzpe: -681.158252 hartree
zpe.sumelectthermal: -681.145810 hartree
zpe.sumelectthermalent: -681.144866 hartree
zpe.sumelectthermalfe: -681.197229 hartree
dipole: 1.9997 -5.0052 0.7421
dipole: 5.4408
quadrupole: -57.9352 -93.4869 -98.1255
quadrupole: -4.7866 -0.5425 3.1896
quadrupole: 25.2473 -10.3044 -14.9429 -4.7866 -0.5425 3.1896
hfenergy: -681.356653 hartree
pointgroup: C01 [X(C12H10N4)]
dipole: 0.7634166 -1.9872822 0.223372 debye
dipolederiv: -0.9799374 -0.1895352 0.0168621 -0.6895396 -0.5038301 -0.0041274 0.1147735 0.0308625 0.006013 0.175568 0.7226728 -0.0747212 0.9131898 0.4058488 -0.0492914 0.0843811 0.0017067 -0.154195 -0.8708076 -0.6184663 0.0503206 0.0067611 0.0184468 -0.0175533 -0.1060874 -0.0416177 -0.193669 -1.69193 0.4545508 -0.0557914 0.3934944 -0.1693129 -0.0637625 -0.0493159 -0.0631108 -0.7541503 0.3760663 -0.0862907 0.021182 -0.4135967 -0.3214163 0.027686 -0.0551462 0.0113761 0.0189347 0.5070476 0.0758833 -0.012127 -0.4188391 -0.1666514 0.0226764 0.0690135 0.0264574 0.0710754 1.3031145 0.2424997 -0.0041405 0.4685109 0.0977343 0.0509581 -0.1037673 0.0063953 0.101969 -0.000177 -0.20319 0.0227197 0.1058865 0.2348574 -0.0489084 -0.0356301 -0.0568209 -0.1068604 -0.3752461 -0.0434893 0.0129028 0.6324678 0.0217671 -0.0159023 -0.0501993 -0.0185123 -0.2252172 1.7502239 -0.5191155 0.0638083 -0.5834881 -0.0772555 0.0237837 0.0614558 0.0285252 0.1434118 -0.2772938 0.3152972 -0.0391213 -0.1750839 0.1880847 -0.0482538 0.0367932 -0.0372492 -0.2091795 -0.1897826 -0.0290956 -0.0362551 -0.226231 -0.1129495 0.0459354 -0.0665752 0.038576 -0.1269916 -0.3607308 -0.0044162 -0.0127644 0.1044767 0.0180474 0.0515323 0.0279539 0.0300418 -0.1273122 0.0025893 0.0183287 -0.0244074 0.0943887 0.1071463 0.0995566 0.0192339 0.0994318 -0.1065566 0.1453285 -0.0578269 -0.0565871 -0.0543155 0.0409037 0.090437 -0.0787286 0.0777523 -0.0986973 -0.0400592 0.0589199 -0.0122377 -0.0048911 -0.0974132 0.0130482 -0.0242565 0.0171247 -0.1631801 0.0343569 -0.1030313 0.007872 -0.0834295 0.0108585 0.0220173 0.0052076 0.0076619 0.154605 -0.0314151 -0.0631063 0.0036592 -0.0905035 0.0262364 0.0137998 0.0158324 0.0119346 0.1818584 0.0216931 0.0888231 -0.0132779 0.0839805 -0.086173 0.0303464 -0.0132811 0.0268539 0.1562268 0.021115 0.0752325 0.0690572 0.079292 0.0549575 -0.0543786 0.0988152 -0.0384501 0.1201414 0.1289868 -0.0543419 -0.0065637 -0.0341048 0.0268214 -0.065368 -0.0303427 -0.0466098 0.1430861 0.0607564 -0.0335576 -0.0012676 -0.072977 -0.0729034 -0.0910304 -0.0171358 -0.088651 0.1189118 -0.0450944 0.0747695 0.0609103 0.0918257 0.0289954 -0.0663209 0.0754016 -0.0613119 0.1181047 -0.1134813 -0.0708595 0.0156091 -0.0800845 0.0770848 -0.0258235 0.0187274 -0.0190921 0.1555212 0.2368656 -0.008709 0.0008879 0.01865 0.105285 0.0321993 -0.0020209 0.0293958 0.3882589 0.2122434 -0.0419464 0.003471 -0.0658396 0.1448298 0.0267439 0.0048979 0.0273298 0.3878909 unknown
polarizability: 270.7176093|-2.50865|160.0764053|-3.2218887|7.0814785|68.0075275 unknown
InChI: InChI=1S/C12H10N4/c13-9-6-7-12-11(8-9)14-15-16(12)10-4-2-1-3-5-10/h1-8H,13H2
charge 0 multiplicity 1
26 atoms
N  -0.429097 0.607458 -0.049982
N  -0.209947 2.024735 -0.162209
N  1.107552 2.236439 -0.182745
N  4.933396 -0.947327 0.138786
C  0.800798 -0.051595 0.00134
C  1.773911 0.99574 -0.082067
C  -1.766165 0.111637 -0.023208
C  1.212206 -1.396585 0.163287
C  3.160834 0.736014 -0.043018
C  3.577932 -0.609633 0.095893
C  2.59032 -1.654212 0.206494
C  -2.067281 -1.181229 -0.519935
C  -2.798247 0.939054 0.487287
C  -3.397976 -1.650634 -0.480786
C  -4.123963 0.461427 0.509089
C  -4.431397 -0.836228 0.034959
H  0.499383 -2.217275 0.276159
H  3.878403 1.559647 -0.108963
H  2.933985 -2.688042 0.334607
H  -1.284557 -1.798686 -0.96972
H  -2.547585 1.939232 0.84985
H  -3.627107 -2.64954 -0.867978
H  -4.919233 1.103288 0.903344
H  -5.46266 -1.203628 0.06108
H  5.650086 -0.232266 0.059693
H  5.22851 -1.912491 0.248945
