program: Gaussian 09
title: 000231700
version: EM64L-G09RevD.01
frameworkgroup: C1[X(C8H12O4)]
method: RPBEPBE
basis: SDD
operation: Freq
keyword: #pfreq=noraman
keyword: PBEPBE/SDD
title: #p freq=noraman PBEPBE/SDD
converged: YES YES NO NO
title: Mulliken charges:
elementType: O O O O C C C C C C C C H H H H H H H H H H H H
charge: -0.412133 -0.410301 -0.208912 -0.213099 -0.064563 -0.481787 -0.456739 -0.416157 -0.453521 -0.268558 0.156409 0.173536 0.259434 0.223239 0.221654 0.262800 0.183940 0.210094 0.217195 0.220214 0.210691 0.283417 0.382688 0.380460
chargesum: 0.00000
title: Mulliken charges with hydrogens summed into heavy atoms:
elementType: O O O O C C C C C C C C
charge: -0.029445 -0.029841 -0.208912 -0.213099 0.194871 -0.036894 -0.009999 0.011131 -0.022616 0.014859 0.156409 0.173536
polarizability: 1.05787314e+02 2.85555844e+00 9.84700499e+01 -1.29586903e+00 -3.78253880e+00 7.92837471e+01
1716.lowfreq: -19.9743 -12.2636 -7.9158 -0.0011 -0.0010 -0.0009 16.8201 37.4776 48.7664
frequency: -11.7282 37.4386 48.7587 71.4523 111.6558 121.4899 142.1056 213.6343 292.7339 313.2663 374.8900 419.2714 508.5754 529.6112 593.4001 604.4659 618.1893 637.6804 688.7594 715.6348 768.2854 820.3716 872.7823 880.8967 898.3026 914.4022 956.8177 975.6550 984.8989 1040.3747 1050.0258 1060.5605 1099.5272 1104.0246 1168.0171 1181.8087 1187.9470 1217.8195 1233.4060 1249.7150 1268.9388 1282.6473 1293.5586 1301.7847 1308.3955 1314.7733 1331.1613 1347.4251 1466.8468 1472.5198 1474.4554 1491.0107 1655.5956 1676.0596 2972.9417 2987.7134 2997.1434 3006.4097 3013.2678 3035.6441 3044.3194 3059.4988 3074.9781 3085.6403 3502.9910 3517.6132
redmass: 1.9057 8.9913 8.4275 2.6962 5.0642 2.9689 6.3920 3.4359 4.7133 5.3396 7.2529 2.4569 2.5526 2.7486 3.2401 1.9360 1.5228 1.8914 3.7868 4.5649 1.2082 1.6957 3.0555 6.2483 2.4610 4.4646 1.5308 2.1137 1.3865 2.7827 2.3801 2.2656 2.0036 3.3024 1.6303 1.4517 1.3725 1.3305 1.2987 1.2874 1.3332 1.5390 1.2614 1.2822 1.3955 1.6362 1.9789 1.5309 1.0791 1.0869 1.0832 1.0988 8.4303 9.5019 1.0679 1.0621 1.0616 1.0805 1.0652 1.0848 1.0998 1.1019 1.1005 1.1012 1.0639 1.0641
irintensity: 0.0847 1.5378 1.2797 0.3358 0.5623 0.5204 0.7262 2.1268 1.7904 6.9960 2.5760 0.8006 8.9145 11.7333 69.8496 32.5082 156.1275 110.7879 13.7337 10.0344 6.0729 1.3094 2.7198 8.7820 2.3124 9.1755 3.4591 4.2801 13.8232 213.8424 247.6121 49.5990 6.3065 1.5911 28.5564 11.0015 5.8429 9.4393 0.0691 2.6638 6.6590 23.7522 5.2845 3.3083 9.9723 20.3356 59.0869 18.1774 1.9554 8.5329 12.7802 2.8901 155.8760 265.9679 26.7977 23.5981 40.1306 16.7626 48.0597 3.2150 14.9819 8.4334 44.6548 60.1373 25.8961 29.0119
temp: 298.150 k
press: 1.00000 atm
elementType: 8 8 8 8 6 6 6 6 6 6 6 6 1 1 1 1 1 1 1 1 1 1 1 1
symmnumber: 1
zpe: 506570.6 jmol-1
zpe.correction: 0.192943 hartree
zpe.thermalcorrener: 0.204444 hartree
zpe.thermalcorrenthalpy: 0.205389 hartree
zpe.thermalcorrgfe: 0.153956 hartree
zpe.sumelectzpe: -612.023193 hartree
zpe.sumelectthermal: -612.011691 hartree
zpe.sumelectthermalent: -612.010747 hartree
zpe.sumelectthermalfe: -612.062180 hartree
dipole: -0.3877 0.9264 -2.0302
dipole: 2.2650
quadrupole: -64.9037 -67.2010 -76.6036
quadrupole: -2.0260 -3.2088 1.7801
quadrupole: 4.6658 2.3684 -7.0342 -2.0260 -3.2088 1.7801
hfenergy: -612.2161354 hartree
pointgroup: C01 [X(C8H12O4)]
dipole: 0.2487247 0.2748757 0.8103472 debye
dipolederiv: -1.0613948 -0.0826173 0.431102 -0.1114201 -0.3560609 0.1458163 0.4176074 0.114643 -0.5870627 -0.3730376 0.0226717 0.1080914 -0.0052732 -0.6978302 -0.5149523 0.0794458 -0.4257138 -0.8176445 -0.6038819 -0.1569717 0.0957497 0.0893317 -0.6867173 -0.3152005 0.2728651 -0.2495176 -0.5792686 -0.5098034 0.1242269 -0.2543519 0.2191803 -0.5723854 0.1041173 -0.2105505 -0.0336296 -0.7876704 0.2074505 -0.0242927 -0.0212197 0.0490156 -0.0022532 0.0113463 -0.0624826 0.0505355 0.1006122 -0.0538426 -0.0367504 0.0173023 0.0119 0.016802 -0.0414436 -0.0022356 0.0093511 0.1361374 -0.0376283 0.0080578 0.037443 -0.0595472 0.0129637 0.0550335 0.0828691 -0.0454821 0.1506868 0.0510731 0.0246618 0.0240152 0.0092376 0.01234 -0.014561 0.0463266 -0.026577 0.142254 0.0231252 -0.0084939 0.0505554 0.0170468 0.0338999 -0.001892 -0.0297802 0.0478258 0.1509992 -0.2073619 0.0834708 0.0019761 0.0144879 -0.4038608 -0.0699079 -0.0358083 -0.1448483 0.0652197 1.2399427 0.3828728 -0.518912 0.2273699 0.9708164 0.338523 -0.6257791 0.3806516 0.7916541 0.535441 -0.4164779 0.2491009 -0.4849153 1.1986793 0.3189792 0.2904981 0.3111556 1.2592265 0.0241759 0.0046069 -0.0332804 0.019216 0.0414988 -0.0127567 -0.0282546 -0.0052709 -0.0917241 0.0440649 0.0142426 0.0417836 0.0020483 0.0521135 -0.0211068 0.0466508 -0.0793617 -0.1282625 0.0242816 0.074832 -0.0342031 0.0726497 -0.1009373 0.0700799 -0.0421812 0.1003813 0.0179758 0.0804232 -0.070746 -0.0150238 -0.0552 -0.1084237 -0.0222221 -0.005743 -0.0529689 0.0627423 0.0324118 0.0118809 0.0225948 0.0053036 0.073675 -0.0223889 0.0068585 0.0485576 -0.1866109 -0.0650894 -0.0573106 -0.0804281 -0.0359889 0.0236982 -0.0498975 -0.1373769 -0.0815023 -0.0494789 0.0087117 -0.0316031 0.0592515 -0.0593326 -0.006749 0.0817691 0.1149486 0.1083619 -0.0852283 0.0657218 -0.01754 -0.0060113 -0.0081988 0.0184971 -0.0426514 0.0619882 -0.0769755 -0.1585672 -0.1444737 0.1106935 -0.0561256 0.0849001 0.0063756 0.0332246 -0.0872275 0.0529839 0.0419107 0.0815544 -0.0152131 -0.0380781 -0.0109879 0.0695199 0.0042012 -0.0023522 0.026128 -0.0270159 0.3263223 -0.0459378 -0.0082329 -0.0900306 0.1790066 -0.1004316 -0.0353133 -0.1301874 0.3021207 0.3118134 0.1017367 -0.0730988 0.099207 0.2253319 0.066322 -0.1149731 0.1014598 0.2769945 unknown
polarizability: 105.0840868|-1.7309974|97.2361853|-4.8633148|6.076151|81.2208393 unknown
InChI: InChI=1S/C8H12O4/c9-7(10)6(8(11)12)5-3-1-2-4-5/h5-6,9,11H,1-4H2
charge 0 multiplicity 1
24 atoms
O  -2.524607 -1.392836 0.905756
O  -1.342601 1.998019 1.28704
O  -1.108714 -2.22262 -0.735809
O  -1.899663 1.410139 -0.890596
C  0.829406 -0.101096 -0.275497
C  1.667253 1.181422 -0.002424
C  1.798894 -1.244167 0.123828
C  3.147849 0.784169 -0.312142
C  3.153687 -0.773548 -0.462315
C  -0.522698 -0.128957 0.485655
C  -1.365937 -1.354023 0.119479
C  -1.335902 1.132259 0.188225
H  0.611948 -0.181593 -1.358447
H  1.560013 1.47451 1.059894
H  1.325674 2.038209 -0.610677
H  1.478079 -2.226444 -0.259892
H  1.86018 -1.307782 1.230118
H  3.814995 1.109157 0.506395
H  3.511754 1.271063 -1.234402
H  3.20967 -1.053705 -1.53099
H  4.015931 -1.243456 0.043121
H  -0.342327 -0.156128 1.576133
H  -3.081243 -2.175123 0.642189
H  -1.855843 2.819931 1.054556
