program: Gaussian 09
title: 000231703
version: EM64L-G09RevD.01
frameworkgroup: C1[X(C10H21NO)]
method: RPBEPBE
basis: SDD
operation: Freq
keyword: #p
keyword: freq=noraman
keyword: PBEPBE/SDD
title: #p freq=noraman PBEPBE/SDD
converged: YES YES NO NO
title: Mulliken charges:
elementType: O N C C C C C C C C C C H H H H H H H H H H H H H H H H H H H H H
charge: -0.258925 -0.604391 -0.425851 -0.140221 -0.364562 -0.371323 -0.384709 -0.357034 -0.356812 0.155634 -0.694629 -0.696253 0.204581 0.179226 0.230949 0.211885 0.200069 0.188226 0.185561 0.207991 0.180291 0.191333 0.191063 0.194590 0.193633 0.219338 0.233893 0.210606 0.210968 0.210429 0.214703 0.330947 0.308791
chargesum: 0.00000
title: Mulliken charges with hydrogens summed into heavy atoms:
elementType: O N C C C C C C C C C C
charge: -0.258925 0.035348 -0.042044 0.090727 0.047392 0.002464 0.003573 0.025363 0.031411 0.155634 -0.030791 -0.060153
polarizability: 1.37637772e+02 1.55117586e+00 1.09647719e+02 7.42473544e-01 -2.30095036e+00 1.06268510e+02
1716.lowfreq: -11.0041 -3.9269 -0.0010 -0.0009 -0.0008 11.7432 28.3350 34.2651 48.3310
frequency: 27.5224 34.0093 48.0365 58.1702 80.9114 96.6495 121.3517 139.7035 147.7460 179.0451 229.1012 234.8192 241.4497 276.0570 290.1113 389.0463 431.4304 452.0264 487.2039 506.5321 527.5350 582.4181 712.1825 722.1920 725.9624 741.6862 781.3355 822.2371 884.1685 888.5210 913.9693 974.9160 995.8342 1008.4929 1028.6601 1040.3000 1047.0663 1072.8041 1079.7035 1089.6395 1101.4115 1119.9136 1141.8525 1191.7111 1223.6247 1237.5932 1242.5950 1269.2175 1277.4535 1286.1792 1296.6667 1297.2787 1319.1355 1323.9549 1329.9638 1349.4110 1355.3882 1363.5939 1389.3357 1393.5812 1457.0046 1461.7597 1464.6654 1469.2809 1474.1018 1475.5649 1477.8112 1481.7528 1482.9021 1488.1643 1586.3837 1636.5659 2945.7858 2949.2332 2955.7397 2960.6691 2965.5682 2970.5325 2972.1270 2980.9509 2985.2585 2995.0969 3002.5004 3006.8979 3022.9679 3030.1030 3042.8552 3068.5993 3070.8364 3077.2279 3079.5002 3515.7186 3671.0601
redmass: 4.2037 3.8509 1.7816 3.2680 2.5978 2.5628 1.7703 2.2332 3.2275 1.6380 1.6471 1.1987 2.3294 2.7870 2.7418 2.8663 3.4763 3.1765 1.2099 2.6597 2.4461 1.2403 1.6320 1.2315 1.8046 1.3959 1.3229 1.4250 1.3249 1.9280 1.8354 1.3229 3.5981 2.5524 1.6485 1.7044 2.5028 2.5570 2.1483 1.8299 2.0862 1.9786 2.6028 1.6757 1.3113 1.3958 1.3113 1.2193 1.1935 1.0866 1.2578 1.1323 1.4285 1.4602 1.4516 1.8714 1.6946 1.7799 1.2168 1.2096 1.0779 1.0716 1.0770 1.0810 1.0808 1.0417 1.0426 1.0809 1.0660 1.0877 1.5505 3.0442 1.0607 1.0594 1.0589 1.0610 1.0594 1.0593 1.0364 1.0360 1.0969 1.0950 1.0982 1.0956 1.0998 1.0991 1.1032 1.1006 1.0993 1.0998 1.1002 1.0442 1.1041
irintensity: 10.0768 4.4802 0.2452 0.3167 0.0219 0.0682 0.0611 0.0061 0.6744 0.0869 0.2292 0.0377 0.4498 0.7122 4.4454 0.0651 1.2195 0.8884 197.9936 23.7908 3.3559 78.2019 16.9989 13.3423 8.0634 4.2730 0.6340 5.0471 0.9120 4.4479 2.8754 3.2887 0.0568 1.2782 2.0357 0.8143 0.5360 1.3046 3.1972 15.6569 3.5068 9.3124 3.8124 1.9412 7.2338 3.0751 3.6633 0.1293 1.1131 2.7580 4.5214 0.0241 13.0435 17.1337 2.5903 29.7246 5.9935 17.8293 11.0313 12.6737 0.3345 0.0951 1.0949 2.2040 3.1332 10.9466 12.0194 2.2331 7.9927 21.1580 70.3229 267.4924 3.4874 15.9065 4.1439 41.4645 30.3508 108.7933 43.8876 28.9902 2.7840 9.7275 4.8136 7.2699 15.8736 0.2795 147.9646 91.7341 54.9506 43.4113 52.3149 21.0515 21.6093
temp: 298.150 k
press: 1.00000 atm
elementType: 8 7 6 6 6 6 6 6 6 6 6 6 1 1 1 1 1 1 1 1 1 1 1 1 1 1 1 1 1 1 1 1 1
symmnumber: 1
zpe: 776649.1 jmol-1
zpe.correction: 0.295810 hartree
zpe.thermalcorrener: 0.311604 hartree
zpe.thermalcorrenthalpy: 0.312548 hartree
zpe.thermalcorrgfe: 0.250883 hartree
zpe.sumelectzpe: -522.659178 hartree
zpe.sumelectthermal: -522.643385 hartree
zpe.sumelectthermalent: -522.642440 hartree
zpe.sumelectthermalfe: -522.704105 hartree
dipole: 0.4584 -2.2746 3.2956
dipole: 4.0305
quadrupole: -79.2032 -79.9410 -73.9495
quadrupole: 4.9666 -8.0772 8.1021
quadrupole: -1.5053 -2.2431 3.7484 4.9666 -8.0772 8.1021
hfenergy: -522.9549883 hartree
pointgroup: C01 [X(C10H21N1O1)]
dipole: -0.1897816 0.9053113 1.2879645 debye
polarizability: 137.6185948|1.7325844|109.71188|-0.695265|2.2689305|106.2235262 unknown
InChI: InChI=1S/C10H21NO/c1-3-5-6-7-8-9(4-2)10(11)12/h9H,3-8,11H2,1-2H3
charge 0 multiplicity 1
33 atoms
O  2.292008 -1.920865 -0.896112
N  2.209478 -1.368474 1.349714
C  0.522648 0.939125 0.237904
C  1.890745 0.446919 -0.314345
C  -0.690125 0.12665 -0.266707
C  -2.039107 0.674252 0.250766
C  3.059163 1.348798 0.178814
C  -3.256304 -0.139619 -0.243322
C  -4.607814 0.407589 0.269932
C  2.144139 -1.038869 0.001535
C  4.433669 0.959298 -0.404677
C  -5.817689 -0.414646 -0.224295
H  0.398993 2.001891 -0.056009
H  0.536545 0.930693 1.349341
H  1.859048 0.491612 -1.420036
H  -0.5806 -0.932815 0.04113
H  -0.692306 0.125162 -1.375914
H  -2.15359 1.732562 -0.065869
H  -2.031397 0.681985 1.361445
H  2.820934 2.395168 -0.099517
H  3.104828 1.330143 1.288054
H  -3.264392 -0.151319 -1.353268
H  -3.144824 -1.196974 0.075873
H  -4.719982 1.462968 -0.053171
H  -4.597118 0.42221 1.3792
H  4.418241 0.996668 -1.509433
H  4.718812 -0.067772 -0.113145
H  5.224048 1.645891 -0.050223
H  -5.869549 -0.417409 -1.329524
H  -5.744111 -1.467138 0.109079
H  -6.770961 -0.004795 0.15758
H  2.3785 -2.341047 1.605162
H  2.087971 -0.674745 2.085236
