program: Gaussian 09
title: 000231780
version: EM64L-G09RevD.01
frameworkgroup: C1[X(C25H18Br2O)]
method: RPBEPBE
basis: SDD
operation: Freq
keyword: #p
keyword: freq=noraman
keyword: PBEPBE/SDD
title: #p freq=noraman PBEPBE/SDD
converged: YES YES NO NO
title: Mulliken charges:
elementType: Br Br O C C C C C C C C C C C C C C C C C C C C C C C C C H H H H H H H H H H H H H H H H H H
charge: 0.002961 0.033335 -0.213575 -0.351808 0.370466 -0.635170 0.511038 0.147674 0.398899 -0.398972 0.153430 -0.407744 -0.400832 -0.393213 -0.475387 -0.259636 -0.438287 0.300178 -0.277233 -0.193494 -0.204834 -0.244325 -0.224499 -0.335820 -0.341797 -0.197599 -0.188143 -0.211427 0.250078 0.240539 0.285143 0.254916 0.243797 0.230507 0.252665 0.240437 0.228226 0.239414 0.230107 0.249768 0.248757 0.230589 0.251024 0.285838 0.255754 0.258252
chargesum: 0.00000
title: Mulliken charges with hydrogens summed into heavy atoms:
elementType: Br Br O C C C C C C C C C C C C C C C C C C C C C C C C C
charge: 0.002961 0.033335 -0.213575 -0.101730 0.370466 -0.109488 0.511038 0.147674 0.398899 -0.144056 0.153430 -0.163946 -0.170325 -0.140548 -0.234949 -0.031409 -0.198873 0.300178 -0.047126 0.056274 0.043923 -0.013736 -0.224499 -0.084797 -0.055959 0.058155 0.070108 -0.211427
polarizability: 3.48285182e+02 1.45173316e+01 3.60890436e+02 -9.45263823e-01 1.50633881e+01 2.39841941e+02
1716.lowfreq: -10.2074 -1.9270 -0.0002 0.0004 0.0005 2.6208 4.0135 8.0155 24.4474
frequency: -10.1014 7.6184 24.4100 28.9397 32.7112 38.9836 52.6982 76.0494 94.6375 111.0660 132.5259 148.8569 165.8010 178.8370 196.6887 223.4722 231.9405 256.4458 274.4004 288.6685 306.2933 327.7645 371.6498 404.3507 404.5729 409.2509 422.8226 454.8081 471.2128 473.8262 486.0829 504.5977 511.0791 521.1229 561.4674 581.5167 610.3206 620.8960 624.9368 642.8322 654.7176 669.7887 705.3784 720.1285 741.0206 747.5267 768.2462 785.3507 788.6948 802.8064 816.8069 826.1411 831.5253 841.1791 853.0229 873.7175 886.0391 927.9782 944.8986 955.1713 962.9420 969.1260 970.5059 976.5230 988.5385 994.2603 994.9592 997.0450 999.2336 1015.5805 1034.0529 1057.3447 1059.2016 1066.8792 1084.9077 1112.1311 1115.0655 1149.7075 1169.5012 1176.4446 1182.4478 1186.8986 1192.4566 1201.1714 1220.4706 1234.0443 1245.4292 1248.1512 1278.3790 1293.1520 1295.0262 1319.6123 1340.4219 1367.7519 1371.5267 1381.7746 1394.2167 1399.5479 1406.6874 1419.7866 1439.7969 1448.5870 1455.4926 1470.2839 1474.9685 1516.5895 1557.0367 1581.3978 1584.2006 1588.4280 1596.9575 1599.2273 1600.1965 1631.1737 2979.4272 3010.3208 3048.0235 3121.3942 3123.4552 3131.8896 3132.2952 3136.6427 3140.1526 3147.5809 3149.5574 3155.0387 3158.5288 3163.4502 3167.1444 3170.7768 3173.1899 3176.7348
redmass: 4.1029 16.4923 5.4797 5.7044 6.9626 5.2517 6.6964 9.2683 6.3609 8.2108 5.8851 8.1845 6.9184 4.2899 4.8340 5.3957 7.3212 4.5356 7.8443 4.6102 4.5760 5.7068 4.5555 2.8550 2.8631 3.8378 3.6089 3.4617 3.5845 4.6569 4.8701 4.9588 4.5925 4.6046 2.5850 3.2551 5.1357 7.0871 6.5710 4.9504 3.6061 6.4118 4.5047 3.6817 3.7851 1.2854 4.2557 3.1628 3.0656 2.3341 1.5775 1.4169 1.2979 1.7547 1.5883 2.0474 2.4099 1.4306 2.0318 1.4469 1.4665 1.4872 1.4569 3.8884 1.3662 1.8974 2.2469 1.8368 2.6775 4.1008 2.3080 3.2447 2.6850 2.4836 2.2278 1.3924 1.4019 1.4387 1.2386 1.1326 1.2703 1.1704 1.1206 1.9769 1.8042 1.9154 2.1209 1.8736 1.6791 1.2688 1.2936 1.8343 1.9447 4.8619 2.5881 3.6163 3.8700 2.1315 2.9740 3.6779 2.3634 1.1588 2.4112 2.2634 2.2784 3.6469 7.8761 6.9629 6.7569 7.4847 6.2182 5.4579 7.0873 6.4320 1.0652 1.0820 1.0928 1.0864 1.0861 1.0879 1.0898 1.0880 1.0912 1.0943 1.0885 1.0888 1.0985 1.1003 1.0951 1.0960 1.0960 1.0974
irintensity: 0.0479 0.0739 0.5066 0.0280 0.0385 0.0055 0.4930 2.2925 0.9167 0.9917 0.2379 0.0763 0.9217 1.4368 6.3457 0.5177 3.0283 2.1668 0.9444 5.8333 2.9808 6.6760 6.6110 0.0891 0.1429 6.8830 11.2561 13.6081 2.0395 8.4159 3.7109 7.4716 21.7164 12.4708 6.5075 5.7126 11.5391 2.5182 1.7941 14.1747 1.1639 9.6243 3.5213 1.2334 28.6507 9.1197 7.3400 21.8870 29.1389 54.3190 43.3054 35.3755 6.7526 15.7831 36.5889 0.6976 5.2158 2.1299 14.3802 3.2991 18.2261 4.0249 6.1218 99.8505 6.5901 36.9755 30.7929 11.9344 9.8658 2.5671 6.7122 13.9858 56.4111 29.2795 8.6832 7.8021 8.3233 0.7497 2.8062 2.0802 1.9488 48.9884 0.7661 15.6812 7.4508 25.2042 18.7898 113.9355 45.4190 0.8320 6.3971 85.7482 6.2320 26.8661 3.3676 5.9327 22.0089 23.8166 1.6089 3.1832 9.1525 49.3071 2.8092 14.3866 76.8122 11.2331 103.9960 1.2682 140.4224 7.5457 15.5447 22.6757 20.9223 1.3101 25.5883 3.2411 11.9349 1.6686 2.1742 4.0715 6.3166 17.3205 15.1188 40.2986 5.4777 0.4212 28.8386 24.8228 10.3078 0.4530 6.5919 2.1019
temp: 298.150 k
press: 1.00000 atm
elementType: 35 35 8 6 6 6 6 6 6 6 6 6 6 6 6 6 6 6 6 6 6 6 6 6 6 6 6 6 1 1 1 1 1 1 1 1 1 1 1 1 1 1 1 1 1 1
symmnumber: 1
zpe: 915855.8 jmol-1
zpe.correction: 0.348831 hartree
zpe.thermalcorrener: 0.372097 hartree
zpe.thermalcorrenthalpy: 0.373041 hartree
zpe.thermalcorrgfe: 0.291032 hartree
zpe.sumelectzpe: -1063.701331 hartree
zpe.sumelectthermal: -1063.678065 hartree
zpe.sumelectthermalent: -1063.677121 hartree
zpe.sumelectthermalfe: -1063.759130 hartree
dipole: -0.7252 3.1322 -1.8325
dipole: 3.7006
quadrupole: -184.8997 -179.3630 -175.3705
quadrupole: 9.8599 -1.7704 -0.6022
quadrupole: -5.0219 0.5147 4.5072 9.8599 -1.7704 -0.6022
hfenergy: -1064.0501619 hartree
pointgroup: C01 [X(C25H18Br2O1)]
dipole: 0.417333 1.2966633 -0.5140355 debye
polarizability: 365.2932008|10.7406312|336.7084867|7.928518|29.6708802|247.0158715 unknown
InChI: InChI=1S/C25H18Br2O/c26-20-12-8-18(9-13-20)24(16-25(28)19-10-14-21(27)15-11-19)23-7-3-5-17-4-1-2-6-22(17)23/h1-15,24H,16H2
charge 0 multiplicity 1
46 atoms
Br -0.716529 -6.456799 -1.242861
Br -7.0842 3.112108 -0.050268
O  -1.346225 -0.217748 2.098918
C  0.768527 -0.48019 0.237283
C  2.052076 -0.012312 -0.47448
C  -0.35758 0.567409 0.017131
C  0.356691 -1.907654 -0.140272
C  2.87807 1.017993 0.12574
C  4.054512 1.48434 -0.586877
C  2.418364 -0.534628 -1.721335
C  -1.511332 0.419156 1.016582
C  0.961394 -2.990894 0.547355
C  -0.574885 -2.209831 -1.163465
C  2.592155 1.605644 1.406771
C  4.380985 0.920659 -1.864128
C  3.577209 -0.073502 -2.418646
C  4.87845 2.502178 -0.001217
C  -2.828369 1.076981 0.718272
C  3.414446 2.595043 1.952469
C  0.65674 -4.332229 0.232843
C  -0.899784 -3.54628 -1.495086
C  4.568448 3.052306 1.24325
C  -0.275551 -4.594041 -0.792335
C  -3.026571 1.936927 -0.395094
C  -3.91576 0.836989 1.602097
C  -4.278793 2.54528 -0.624483
C  -5.173743 1.428843 1.382727
C  -5.339981 2.279721 0.266908
H  0.957611 -0.502015 1.327255
H  -0.726536 0.536003 -1.023317
H  0.063957 1.585397 0.149806
H  1.811552 -1.327598 -2.170332
H  1.681682 -2.78411 1.34752
H  -1.071701 -1.408608 -1.72128
H  1.722726 1.268476 1.980479
H  5.272823 1.28032 -2.390991
H  3.828603 -0.511337 -3.390792
H  5.764183 2.840689 -0.55237
H  3.177219 3.021606 2.93331
H  1.13079 -5.153133 0.778316
H  -1.624916 -3.760647 -2.28544
H  5.205116 3.828531 1.681456
H  -2.206658 2.152979 -1.087239
H  -3.749949 0.17766 2.4603
H  -4.425966 3.211597 -1.478888
H  -6.008198 1.235219 2.06231
