program: Gaussian 09
title: 000231789
version: EM64L-G09RevD.01
frameworkgroup: C1[X(C31H26O)]
method: RPBEPBE
basis: SDD
operation: Freq
keyword: #pfreq=noraman
keyword: PBEPBE/SDD
title: #p freq=noraman PBEPBE/SDD
converged: YES YES NO NO
title: Mulliken charges:
elementType: O C C C C C C C C C C C C C C C C C C C C C C C C C C C C C C C H H H H H H H H H H H H H H H H H H H H H H H H H H
charge: -0.466436 -0.353132 -0.589160 0.035289 0.432072 0.490245 0.366198 0.383723 0.145516 -0.436113 0.412767 -0.416522 -0.385294 -0.386094 -0.377829 -0.396557 -0.402898 -0.363882 -0.270566 -0.478219 -0.436637 -0.232029 -0.253857 -0.241597 -0.226356 -0.233770 -0.257131 -0.286849 -0.245447 -0.246444 -0.242437 -0.249644 0.249451 0.221874 0.225900 0.226601 0.356404 0.235757 0.229241 0.237847 0.271146 0.297503 0.239130 0.230041 0.226041 0.239562 0.237301 0.223910 0.222218 0.224254 0.225082 0.226493 0.223809 0.228863 0.227648 0.226420 0.228023 0.228575
chargesum: 0.00000
title: Mulliken charges with hydrogens summed into heavy atoms:
elementType: O C C C C C C C C C C C C C C C C C C C C C C C C C C C C C C C
charge: -0.110032 -0.103681 -0.141386 0.035289 0.432072 0.490245 0.366198 0.383723 0.145516 -0.209513 0.412767 -0.180765 -0.156054 -0.148247 -0.106683 -0.099054 -0.163768 -0.133842 -0.044525 -0.238657 -0.199336 -0.008119 -0.031638 -0.017343 -0.001274 -0.007277 -0.033321 -0.057986 -0.017799 -0.020024 -0.014414 -0.021070
polarizability: 3.16029720e+02 4.39432386e+01 3.39647743e+02 -2.67086386e+01 -2.48218483e+01 3.24232344e+02
1716.lowfreq: -0.0008 -0.0007 -0.0003 3.3399 5.7489 8.2602 18.3613 24.6062 29.0569
frequency: 18.2102 24.4492 29.0245 32.6680 35.9984 42.9390 49.2316 53.8828 60.9279 106.4951 126.3597 137.8239 178.6513 186.6424 197.2351 215.0719 222.1001 241.9628 262.1649 269.7416 281.9228 293.3693 341.3297 347.5546 401.0360 402.5935 402.7089 404.4830 417.1974 437.5989 456.3295 471.7085 485.3966 491.7441 510.8585 520.5499 532.4859 565.3932 589.2060 599.3775 615.5603 616.9141 617.0784 631.6832 641.6791 664.3577 696.0900 702.9110 704.5595 707.3620 717.2648 743.1806 759.4071 767.7414 781.0732 784.9684 789.5933 806.6744 826.5025 835.6255 848.4154 852.0341 856.6352 867.0636 885.1560 907.6010 910.0734 923.2871 924.0568 940.2121 961.0514 973.2285 976.8728 980.0459 981.4573 985.1152 989.9188 990.3208 990.8944 992.1337 993.0905 995.7547 1000.5820 1002.0944 1027.9891 1029.0552 1030.4606 1033.8983 1046.8730 1068.9688 1081.0248 1086.2762 1097.0335 1109.8939 1149.3160 1151.3810 1170.6517 1171.2473 1171.5985 1172.7778 1179.0037 1185.6377 1187.7244 1191.2682 1193.0323 1195.5076 1206.6671 1234.5049 1240.1716 1249.9880 1265.0817 1307.9561 1315.1151 1316.5347 1325.9599 1338.7240 1355.8607 1379.1792 1379.7244 1381.2331 1382.5699 1404.1890 1413.6016 1431.7197 1434.9268 1438.9749 1441.5102 1455.1844 1461.4641 1478.5240 1480.8416 1483.7594 1517.8235 1585.1377 1589.1814 1590.7147 1591.9538 1598.0901 1608.3355 1611.9489 1612.6133 1631.2424 2989.7526 3042.5534 3055.4943 3118.3023 3119.1426 3119.5080 3120.3519 3121.1081 3121.7370 3126.5055 3129.6322 3130.5428 3131.7952 3135.2203 3140.1808 3143.6326 3144.2984 3149.9467 3154.5407 3155.0052 3158.2152 3162.1533 3163.9590 3166.3944 3178.1452 3553.3408
redmass: 5.5771 5.0395 4.2459 3.8478 4.4105 4.5266 4.5114 5.1468 4.8733 4.7106 4.3281 5.2509 3.9152 5.7559 4.1581 4.4598 4.4894 4.2769 4.0168 3.7037 4.8192 1.2354 3.2319 4.4844 3.9538 2.8271 2.8375 2.9189 3.2941 4.0911 4.0358 3.2685 3.8124 4.3639 4.5129 5.3613 4.1069 3.7551 3.7317 3.7567 6.2909 6.3878 6.3597 4.9816 4.7430 3.7423 4.7150 1.7356 1.6491 1.7153 3.5260 1.2954 1.8660 2.2009 2.2307 4.9723 2.1530 1.6681 2.6170 3.8298 1.2654 1.2580 1.2591 2.2481 2.4714 1.6994 1.6975 1.4706 1.5577 2.1659 1.3916 1.3923 1.4117 1.4020 1.3907 3.6964 5.1394 5.1405 3.1002 1.3552 1.6745 1.3733 1.3501 2.5083 2.3212 2.1596 2.1722 2.3096 3.2420 2.0935 1.6249 2.0215 1.9069 2.4544 2.0930 1.4655 1.1346 1.0808 1.0689 1.1185 1.1731 1.4013 1.2436 1.7640 1.2249 1.5114 1.3903 1.9506 1.9497 1.6834 1.6037 1.5012 1.3705 1.3863 1.3435 1.4950 1.4554 7.3686 2.1455 7.8112 4.7618 2.9866 4.2096 2.2025 2.2422 2.2120 2.4205 2.3396 1.1166 2.2253 2.1711 2.1693 3.6339 7.2727 6.1136 6.2632 5.9542 5.2392 6.0847 6.0726 6.0163 6.3676 1.0605 1.0853 1.0962 1.0846 1.0848 1.0858 1.0857 1.0845 1.0870 1.0882 1.0908 1.0879 1.0886 1.0915 1.0938 1.0929 1.0961 1.0939 1.0992 1.0958 1.0991 1.1015 1.0995 1.0998 1.0948 1.0661
irintensity: 0.1458 0.2919 0.2885 0.1390 0.0155 0.0293 0.0954 0.0757 0.0853 0.3343 1.0309 0.0720 0.7151 0.6879 3.6513 1.1174 0.8425 5.8300 7.4507 3.4224 1.6462 289.7294 16.3901 2.7873 6.3913 0.4577 0.2209 1.4798 6.1810 1.9161 2.5042 0.2744 0.9674 3.9522 9.8633 2.0758 28.6055 4.8124 2.8776 37.8497 1.0812 0.3780 0.9425 7.3885 15.8283 0.5824 0.6863 38.6735 48.7335 92.9879 5.4733 3.3803 43.3035 14.4594 54.2850 1.5059 44.1749 85.2437 2.5751 0.1838 0.9560 0.4150 0.8754 3.3686 9.4597 5.1263 4.8781 0.8299 10.1053 5.8979 1.1529 0.1718 1.8488 5.4756 0.6183 30.6839 1.1604 0.6862 5.3189 2.5328 3.2809 0.4183 2.5233 20.0322 12.5300 8.5163 3.4309 5.0177 19.1206 7.3089 1.1986 3.9580 6.8881 1.5741 25.0006 1.0103 2.5493 0.8288 0.4793 2.3947 0.6493 7.6493 1.3939 2.7087 5.7859 0.8445 1.8548 5.8653 6.5678 5.6889 3.6620 1.5325 1.2974 6.7489 8.0337 19.2065 8.1217 0.4015 19.1180 2.0463 3.2057 2.3532 3.4999 3.7203 19.1356 12.5010 5.3965 2.1821 7.5719 25.3962 13.0381 21.4353 9.9562 8.4451 0.6765 0.5909 2.3438 4.7340 8.2410 9.7802 6.6005 0.3147 18.4454 3.3785 24.7814 9.6774 2.6527 3.6854 0.0563 2.6975 0.3969 4.8792 19.3123 6.0475 9.5925 18.1229 27.6925 38.7984 37.0949 45.7443 35.4516 24.6392 29.7034 27.4547 17.5821 17.8635 5.9464 19.0529
temp: 298.150 k
press: 1.00000 atm
elementType: 8 6 6 6 6 6 6 6 6 6 6 6 6 6 6 6 6 6 6 6 6 6 6 6 6 6 6 6 6 6 6 6 1 1 1 1 1 1 1 1 1 1 1 1 1 1 1 1 1 1 1 1 1 1 1 1 1 1
symmnumber: 1
zpe: 1235651.7 jmol-1
zpe.correction: 0.470635 hartree
zpe.thermalcorrener: 0.497050 hartree
zpe.thermalcorrenthalpy: 0.497995 hartree
zpe.thermalcorrgfe: 0.411439 hartree
zpe.sumelectzpe: -1269.930426 hartree
zpe.sumelectthermal: -1269.904011 hartree
zpe.sumelectthermalent: -1269.903066 hartree
zpe.sumelectthermalfe: -1269.989622 hartree
dipole: -0.0904 0.9558 -0.6097
dipole: 1.1373
quadrupole: -180.7672 -175.0695 -172.6119
quadrupole: 9.1976 -4.3294 -3.7511
quadrupole: -4.6176 1.0800 3.5376 9.1976 -4.3294 -3.7511
hfenergy: -1270.401061 hartree
pointgroup: C01 [X(C31H26O1)]
dipole: -0.0801782 -0.4223397 0.1241304 debye
polarizability: 305.5118131|-44.8551941|365.7875065|10.366805|-11.5246409|308.6104875 unknown
InChI: InChI=1S/C31H26O/c32-31(26-17-6-2-7-18-26,27-19-8-3-9-20-27)23-30(25-13-4-1-5-14-25)29-22-12-16-24-15-10-11-21-28(24)29/h1-22,30,32H,23H2
charge 0 multiplicity 1
58 atoms
O  1.301202 1.076961 0.999503
C  -0.827583 -0.625733 -0.190858
C  0.618753 -1.133279 0.066903
C  1.707856 -0.015591 0.088615
C  -1.474215 0.027597 1.051331
C  -1.753072 -1.743417 -0.711088
C  1.845192 0.636197 -1.304977
C  3.078771 -0.564751 0.555288
C  -2.114226 1.327067 0.995864
C  -1.504851 -0.688098 2.258343
C  -2.749312 1.85193 2.19446
C  -2.843132 -1.404605 -1.55425
C  -1.581587 -3.105209 -0.352241
C  2.388971 -0.108014 -2.382571
C  4.037488 0.358865 1.048108
C  1.419967 1.966999 -1.534284
C  3.432714 -1.935674 0.485662
C  -2.158565 2.139917 -0.18899
C  -2.123274 -0.167398 3.434308
C  -2.735052 1.084694 3.404626
C  -3.388686 3.135923 2.155267
C  -3.735178 -2.392284 -2.025461
C  -2.471891 -4.097592 -0.82123
C  2.494631 0.462485 -3.669177
C  5.31286 -0.075855 1.464058
C  1.534002 2.541159 -2.821917
C  4.711126 -2.373915 0.903915
C  -2.791447 3.384759 -0.198147
C  -3.553949 -3.746251 -1.659466
C  2.066592 1.792085 -3.895107
C  5.656783 -1.447047 1.393854
C  -3.415401 3.892217 0.983826
H  -0.753001 0.126248 -0.994111
H  0.675132 -1.689014 1.022932
H  0.87723 -1.848212 -0.735201
H  -1.064318 -1.690786 2.303766
H  0.977366 0.680168 1.848162
H  -2.997034 -0.357109 -1.840661
H  -0.748039 -3.403508 0.293913
H  2.750661 -1.129566 -2.215376
H  3.762421 1.416737 1.106305
H  1.018491 2.541625 -0.695471
H  2.719615 -2.677643 0.110857
H  -1.680697 1.790322 -1.108759
H  -2.121134 -0.763104 4.353667
H  -3.217508 1.495192 4.299509
H  -3.860646 3.512767 3.070766
H  -4.568526 -2.106667 -2.677488
H  -2.320333 -5.14428 -0.532881
H  2.917636 -0.125506 -4.491586
H  6.039637 0.652263 1.842136
H  1.20824 3.575288 -2.9838
H  4.965508 -3.438515 0.845871
H  -2.807398 3.980409 -1.117647
H  -4.244192 -4.515257 -2.023915
H  2.154027 2.237795 -4.892478
H  6.647212 -1.786529 1.717296
H  -3.90814 4.870434 0.964528
