program: Gaussian 09
title: 000231725
version: EM64L-G09RevD.01
frameworkgroup: C1[X(C14H20N4O2S)]
method: RPBEPBE
basis: SDD
operation: Freq
keyword: #p
keyword: freq=noraman
keyword: PBEPBE/SDD
title: #p freq=noraman PBEPBE/SDD
converged: NO YES NO NO
title: Mulliken charges:
elementType: S O O N N N N C C C C C C C C C C C C C C H H H H H H H H H H H H H H H H H H H H
charge: 0.234190 -0.238967 -0.272435 -0.293707 0.014748 -0.152773 -0.223414 0.012644 -0.435141 -0.431001 -0.400433 -0.405168 -0.384874 -0.494887 -0.176733 -0.235926 0.186361 0.171200 0.213344 -0.631112 -0.600068 0.252066 0.179287 0.199592 0.212822 0.182404 0.197759 0.197278 0.199188 0.202341 0.202602 0.186468 0.220323 0.255159 0.310705 0.245209 0.245036 0.286223 0.249046 0.271962 0.248683
chargesum: 0.00000
title: Mulliken charges with hydrogens summed into heavy atoms:
elementType: S O O N N N N C C C C C C C C C C C C C C
charge: 0.234190 -0.238967 -0.272435 0.016998 0.014748 -0.152773 -0.223414 0.264710 -0.056262 -0.035775 -0.005396 -0.003639 0.004196 -0.019405 -0.176733 -0.235926 0.186361 0.171200 0.213344 0.145355 0.169623
polarizability: 2.82641658e+02 -6.74782130e+00 2.12504288e+02 -2.36688745e+01 -6.95619080e+00 1.32272983e+02
1716.lowfreq: -11.1556 -5.5354 -0.0010 0.0012 0.0019 7.3221 11.2110 28.0171 33.6690
frequency: -2.2931 27.2035 32.9324 61.7553 90.3564 95.1238 103.9652 113.2480 134.5111 139.8198 143.8528 175.0408 218.8021 232.2635 242.5421 283.9214 296.1731 307.8764 313.3685 320.2331 358.0054 376.7147 386.5307 390.5298 396.4281 419.6426 427.1231 435.8389 479.6918 496.4652 540.0148 557.0252 566.2804 580.5721 607.4666 700.7479 711.0118 735.0438 747.1904 777.8156 788.5769 834.3631 842.2387 853.2541 894.8336 913.8707 937.8303 946.8346 962.8101 995.0679 1008.8747 1035.1270 1052.9155 1060.2320 1074.8962 1087.6790 1098.2776 1117.4075 1127.2082 1130.5924 1151.0459 1176.4610 1188.9797 1226.2232 1229.4584 1236.8383 1256.0272 1260.8039 1273.3219 1277.4986 1297.3913 1316.1803 1336.0147 1336.8543 1339.0470 1341.2619 1341.7225 1359.1985 1365.2646 1396.0876 1420.2834 1430.7074 1446.9592 1460.5653 1463.6661 1465.6182 1466.6317 1471.1721 1474.5984 1476.1240 1478.1723 1479.6906 1486.6587 1538.6912 1596.2864 1639.4010 1650.2691 2941.5212 2948.5334 2964.8676 2968.8560 2971.6360 2979.0786 2990.2723 2994.1386 3011.9841 3012.8060 3022.9581 3028.4307 3031.2332 3042.6490 3062.8783 3077.6496 3103.8574 3128.2266 3139.9352 3595.2491
redmass: 4.3608 5.2239 3.2953 4.7946 3.0439 1.3095 3.3992 3.5525 1.1993 3.6642 5.8199 4.2645 1.7798 4.4743 2.5234 4.4369 5.1894 3.1034 1.9418 1.7876 6.2121 4.6789 3.4075 6.0048 3.4882 2.5236 4.9974 2.7504 4.5235 5.0089 2.0283 9.5126 6.2546 11.2816 6.9942 11.0263 3.7967 11.3404 5.3643 2.4890 1.5002 5.8096 2.0749 2.0089 1.6121 1.7723 2.2773 2.6727 2.3122 4.9116 4.4640 3.0719 1.8435 1.1410 2.1711 1.4209 2.8788 2.6657 1.2890 1.3088 2.4163 3.3163 1.5486 1.4042 2.9394 3.1351 1.2299 1.2519 2.6134 1.9501 1.1873 1.2800 2.3957 1.4186 1.7086 1.5420 1.5715 1.4317 1.4128 2.4231 1.3718 1.5472 1.1061 1.1101 1.1716 1.1010 1.2273 1.0932 1.0596 1.0437 1.0995 1.1596 1.0434 7.1012 10.5260 9.9964 10.2099 1.0624 1.0639 1.0625 1.0637 1.0625 1.0772 1.0344 1.0645 1.0330 1.0956 1.0980 1.0951 1.1019 1.1037 1.1034 1.1031 1.1022 1.0990 1.1021 1.0780
irintensity: 0.5787 1.0765 0.3272 0.2322 1.2448 0.3157 0.6845 8.5712 0.0727 3.3452 1.7820 1.6604 0.1445 1.0977 0.7194 8.3212 0.3436 2.1780 57.8767 28.7627 6.9183 0.4130 24.9309 40.7005 16.2366 8.5313 2.6341 0.3429 20.9600 2.0975 9.2799 20.7973 0.0839 10.7791 0.7064 9.3819 5.8095 6.9438 3.7179 1.5374 0.1084 29.8902 11.1832 1.9236 10.3267 1.1157 45.0402 6.4048 6.6804 14.7194 7.9559 50.3357 4.1722 0.1518 57.5646 30.5280 29.6606 0.3356 0.2678 0.0339 0.5082 95.8328 11.7074 8.9965 7.9209 1.9603 10.4073 3.8216 49.9027 78.0771 4.3230 10.6663 4.0198 1.9779 14.4566 32.3169 1.9967 14.8138 5.2432 5.3853 63.0704 168.5287 29.2581 13.7735 47.9847 13.1581 21.9961 32.0632 8.5102 18.2918 10.7713 47.9936 20.5362 68.7829 915.9358 310.5267 336.6631 30.0769 36.6522 37.6876 27.0616 27.6221 4.4339 32.9140 42.6073 29.9391 84.5103 42.5323 58.9318 29.8834 119.3517 22.4578 18.6895 17.6257 1.0044 1.1654 74.3497
temp: 298.150 k
press: 1.00000 atm
elementType: 16 8 8 7 7 7 7 6 6 6 6 6 6 6 6 6 6 6 6 6 6 1 1 1 1 1 1 1 1 1 1 1 1 1 1 1 1 1 1 1 1
symmnumber: 1
zpe: 872998.5 jmol-1
zpe.correction: 0.332508 hartree
zpe.thermalcorrener: 0.352554 hartree
zpe.thermalcorrenthalpy: 0.353499 hartree
zpe.thermalcorrgfe: 0.283515 hartree
zpe.sumelectzpe: -1311.453215 hartree
zpe.sumelectthermal: -1311.433168 hartree
zpe.sumelectthermalent: -1311.432224 hartree
zpe.sumelectthermalfe: -1311.502207 hartree
dipole: 3.2902 -5.1741 0.1601
dipole: 6.1337
quadrupole: -133.1393 -128.4980 -132.8352
quadrupole: 1.1650 -0.7785 3.2001
quadrupole: -1.6485 2.9928 -1.3444 1.1650 -0.7785 3.2001
hfenergy: -1311.7857221 hartree
pointgroup: C01 [X(C14H20N4O2S1)]
dipole: 1.3456349 -1.9929143 -0.2024671 debye
polarizability: 282.825214|-1.8251495|212.7985315|-24.2908544|3.062288|131.7951836 unknown
InChI: InChI=1S/C14H20N4O2S/c1-17-11(19)10-12(18(2)14(17)20)21-13(16-10)15-8-9-6-4-3-5-7-9/h9,15H,3-8H2,1-2H3
charge 0 multiplicity 1
41 atoms
S  -0.947782 -2.461223 -0.457175
O  -1.625899 2.581205 -0.197301
O  -5.375393 -0.087057 0.782957
N  1.634645 -1.552444 -1.183086
N  -0.03209 0.096116 -0.663377
N  -3.373833 -1.177289 0.220095
N  -3.490255 1.219125 0.289069
C  3.444023 -0.005795 -0.274774
C  4.222142 -1.103466 0.493222
C  4.398963 1.127448 -0.729426
C  5.020729 -0.515511 1.681894
C  5.198755 1.715813 0.456641
C  5.972141 0.612062 1.216866
C  2.693128 -0.570351 -1.506103
C  0.387982 -1.141476 -0.795564
C  -2.044171 -1.055204 -0.144406
C  -1.385433 0.166358 -0.306783
C  -2.104178 1.419016 -0.087533
C  -4.15701 -0.010395 0.452126
C  -4.01714 -2.497215 0.368022
C  -4.314523 2.425729 0.534937
H  2.685537 0.436182 0.403902
H  4.928544 -1.601556 -0.207012
H  3.522802 -1.881678 0.859669
H  3.816732 1.927215 -1.228014
H  5.110283 0.726079 -1.483894
H  4.31072 -0.107482 2.430473
H  5.593252 -1.317362 2.187603
H  5.898188 2.493228 0.092765
H  4.497447 2.216964 1.154837
H  6.503357 1.046356 2.085839
H  6.747255 0.182648 0.547965
H  3.40902 -1.069047 -2.188636
H  2.21457 0.260726 -2.05522
H  1.865556 -2.543328 -1.147764
H  -3.517914 -3.081921 1.161075
H  -3.971812 -3.054437 -0.584628
H  -5.06734 -2.322144 0.644453
H  -5.173199 2.444179 -0.155961
H  -3.667464 3.299471 0.37164
H  -4.700138 2.416162 1.567509
