program: Gaussian 09
title: 000231677
version: EM64L-G09RevD.01
frameworkgroup: C1[X(C10H12N2O)]
method: RPBEPBE
basis: SDD
operation: Freq
keyword: #p
keyword: freq=noraman
keyword: PBEPBE/SDD
title: #p freq=noraman PBEPBE/SDD
converged: YES YES NO NO
title: Mulliken charges:
elementType: O N N C C C C C C C C C C H H H H H H H H H H H H
charge: -0.265808 -0.165050 -0.614990 -0.190860 -0.434364 -0.554168 0.189462 0.491623 -0.440236 -0.359595 -0.216222 -0.221873 -0.237422 0.262721 0.254776 0.229420 0.189728 0.241944 0.230190 0.240621 0.327118 0.359032 0.227633 0.226190 0.230130
chargesum: 0.00000
title: Mulliken charges with hydrogens summed into heavy atoms:
elementType: O N N C C C C C C C C C C
charge: -0.265808 -0.165050 0.071159 0.071861 0.049831 -0.122495 0.189462 0.491623 -0.210045 -0.118974 0.011412 0.004317 -0.007292
polarizability: 1.30576151e+02 -1.69518185e+01 1.09488873e+02 6.11497218e+00 8.28725859e+00 1.11716347e+02
1716.lowfreq: -13.5906 -8.0376 -0.0008 -0.0005 0.0005 4.1500 16.1643 34.7070 56.0865
frequency: 13.8732 34.5664 56.0440 101.7560 152.8140 188.8071 248.3441 334.4123 346.0669 361.7098 403.5869 441.3063 478.5069 522.6128 565.6199 591.9540 617.0977 684.1287 696.0447 705.8677 744.5660 781.9620 790.6508 816.4961 852.3606 853.1320 913.9356 962.1861 974.8621 989.9972 994.7951 998.0085 1010.0916 1027.2110 1049.3948 1074.0548 1086.3856 1098.2818 1118.9132 1172.6025 1185.2842 1186.6506 1216.6527 1236.8423 1310.8363 1318.5354 1346.5388 1373.8979 1386.7616 1440.3228 1464.8016 1469.6538 1484.9776 1551.6515 1595.8794 1616.0958 1647.2435 2913.4498 3013.3056 3063.2138 3113.4380 3116.9447 3124.3000 3136.9577 3148.1149 3164.2981 3179.7777 3466.7448 3657.1399
redmass: 3.9495 5.9653 4.4228 4.2782 4.6419 3.9740 3.7552 2.7148 2.7103 3.7175 2.8103 4.9817 3.2731 2.8810 1.2573 4.6261 6.3078 4.3219 1.1934 1.6246 1.8462 2.3223 3.8392 3.3498 2.2818 1.7190 1.3931 1.7510 1.3891 5.4887 1.5301 1.9580 1.7831 2.1129 1.5588 1.6447 1.5207 1.2982 1.6921 1.0563 1.3892 1.1818 2.4211 1.5729 1.7754 1.3730 1.3979 3.9875 6.2183 2.1318 1.1273 1.1366 2.2194 1.2945 6.1235 6.1583 6.7456 1.0676 1.0925 1.0555 1.0899 1.0873 1.0861 1.0913 1.0963 1.1016 1.1153 1.0478 1.1010
irintensity: 0.4046 2.1922 1.4101 6.3119 5.7360 8.5859 3.1795 2.8793 0.9606 3.7829 0.2888 5.4075 8.7551 5.6032 179.2565 3.5398 0.5270 67.4160 36.0004 58.3239 56.8911 5.9981 16.3128 1.7270 0.8007 0.2385 3.5897 6.4806 0.1638 1.2011 10.5262 21.9199 9.0341 5.7793 7.0051 14.9661 7.2684 9.6959 7.4003 0.1430 10.1272 1.1013 1.6371 12.9790 44.4648 7.0001 12.0976 53.1529 2.1777 9.6377 0.9323 11.1370 8.1447 148.2490 1.2482 2.2147 322.8525 62.2271 19.8958 32.5830 4.2092 9.2495 0.5329 14.8945 40.1143 19.4186 12.4403 43.4475 66.5554
temp: 298.150 k
press: 1.00000 atm
elementType: 8 7 7 6 6 6 6 6 6 6 6 6 6 1 1 1 1 1 1 1 1 1 1 1 1
symmnumber: 1
zpe: 531054.1 jmol-1
zpe.correction: 0.202268 hartree
zpe.thermalcorrener: 0.214177 hartree
zpe.thermalcorrenthalpy: 0.215121 hartree
zpe.thermalcorrgfe: 0.161806 hartree
zpe.sumelectzpe: -572.003893 hartree
zpe.sumelectthermal: -571.991985 hartree
zpe.sumelectthermalent: -571.991040 hartree
zpe.sumelectthermalfe: -572.044355 hartree
dipole: 2.3318 2.2111 -2.5010
dipole: 4.0720
quadrupole: -83.8606 -71.4181 -75.0941
quadrupole: -9.5535 12.2484 9.6380
quadrupole: -7.0697 5.3729 1.6968 -9.5535 12.2484 9.6380
hfenergy: -572.2061611 hartree
pointgroup: C01 [X(C10H12N2O1)]
dipole: 1.0019551 -1.227788 0.2348521 debye
dipolederiv: -0.6639237 0.3246416 -0.1830351 0.421826 -0.8088288 0.1772202 -0.0517105 0.0214496 -0.6060361 -0.8475418 0.15587 0.0294388 0.1660804 -0.1529752 -0.0100139 -0.0728446 -0.0796586 -0.380045 -0.6099451 -0.0759819 -0.0276176 -0.0643882 -0.5124378 0.0745889 -0.1651639 0.1708623 -1.0179929 0.2104702 0.0611492 0.0232202 0.0820926 -0.2167966 -0.1228415 0.0782086 -0.0519932 0.0581236 0.1640751 -0.0287919 -0.0419446 -0.0355235 0.0550564 0.0341876 0.0563433 -0.0342997 0.1867401 0.6094874 -0.0491257 -0.0579662 -0.0878774 0.1847094 0.0044572 -0.0705108 0.0741938 0.3058849 0.6218395 -0.5560482 0.2810243 -0.6319333 0.9123666 -0.1026525 0.1953541 0.012953 1.2421634 0.0529596 0.0912807 0.0059919 0.1592177 0.0212128 0.0034449 0.0516222 -0.0234776 -0.0483855 -0.1459963 0.0323823 0.0639025 0.0213096 -0.125933 0.0062133 0.0283517 0.0146373 0.0572762 -0.094555 0.0593152 -0.0628224 0.013508 -0.1155069 -0.0604862 -0.0709961 -0.0735816 0.012836 -0.0640268 0.0778357 -0.0541822 0.0704197 -0.0602758 -0.0796218 -0.0634117 -0.0827314 0.0573764 -0.077055 0.0515176 0.0642636 0.0563419 -0.1044478 0.0227721 0.0863786 0.0155439 0.1108017 -0.0178586 0.1305391 0.0271652 0.1169244 -0.0554785 0.0078779 0.0223888 0.0075704 -0.0688102 0.0728317 0.0478039 0.0789899 0.0293687 0.0245515 0.031159 0.039983 0.03987 -0.0445783 -0.0533367 -0.0763671 0.0493768 -0.0622747 0.0530252 -0.0057112 0.0837416 0.0380061 0.014509 0.043182 -0.0143557 0.0427673 -0.027992 0.0149594 -0.1009917 -0.0558248 -0.1261287 -0.0663816 -0.0641532 -0.0076312 -0.0421557 0.0201384 0.0641306 0.0212601 0.0419367 -0.0866652 -0.2085954 -0.052168 0.0110674 0.0010549 0.0349172 -0.1354587 0.0068317 0.0263551 0.0706886 0.0625989 0.0822887 -0.0461967 -0.0999673 -0.042741 0.1087717 -0.0368374 -0.077615 -0.0242508 -0.0715508 0.1022073 -0.075833 0.0778945 -0.0694427 0.0752743 0.0663046 0.0823784 0.0644354 -0.0158007 0.2887999 0.1022469 -0.0283166 0.1059268 0.2245435 -0.0341483 -0.0165154 -0.039789 0.2010031 0.3281227 0.0444872 -0.1092987 0.0111502 0.2985902 0.0509695 -0.1020849 0.0454115 0.2697775 0.0634499 -0.0760527 0.0604988 -0.0906567 0.0801639 0.0811645 0.0744518 0.0850294 -0.0398684 0.0728987 -0.0469591 -0.0691753 -0.0500972 0.1209329 -0.021429 -0.0889986 -0.0243077 -0.0954803 -0.0220525 -0.1367936 -0.0291072 -0.1462949 0.0498505 -0.013718 -0.0318176 -0.0137678 0.0844344 unknown
polarizability: 129.9330387|18.7740115|104.0193151|2.6425879|0.2956195|117.8290176 unknown
InChI: InChI=1S/C10H12N2O/c11-10(13)9-7-12(9)6-8-4-2-1-3-5-8/h1-5,9H,6-7,11H2
charge 0 multiplicity 1
25 atoms
O  -3.336819 1.921876 -0.007647
N  -1.078341 -1.077728 0.079765
N  -2.257284 0.783057 1.735386
C  -2.011372 -0.054071 -0.522493
C  -2.423753 -1.523733 -0.427155
C  0.1074 -1.470869 -0.747558
C  -2.596049 0.984446 0.414017
C  1.275785 -0.523479 -0.521527
C  1.887067 0.14455 -1.610044
C  1.780655 -0.307278 0.786703
C  2.985501 1.01111 -1.400491
C  2.874707 0.558515 0.999838
C  3.482142 1.220107 -0.094417
H  -1.792739 0.337177 -1.524136
H  -3.142827 -1.831756 0.337938
H  -2.464956 -2.089611 -1.368139
H  -0.139763 -1.512053 -1.833762
H  0.373728 -2.497788 -0.429906
H  1.503641 -0.011273 -2.626301
H  1.305869 -0.816719 1.633273
H  -2.601431 1.420056 2.451057
H  -1.582484 0.041512 1.944575
H  3.447895 1.522502 -2.252144
H  3.255807 0.717912 2.014943
H  4.331821 1.891936 0.070925
