program: Gaussian 09
title: 000231679
version: EM64L-G09RevD.01
frameworkgroup: C1[X(C11H16N2O3)]
method: RPBEPBE
basis: SDD
operation: Freq
keyword: #p
keyword: freq=noraman
keyword: PBEPBE/SDD
title: #p freq=noraman PBEPBE/SDD
converged: YES YES NO NO
title: Mulliken charges:
elementType: O O O N N C C C C C C C C C C C H H H H H H H H H H H H H H H H
charge: -0.205156 -0.205088 -0.217875 -0.372153 -0.367849 -0.009319 -0.423027 -0.452931 -0.346928 -0.423628 -0.411543 -0.391801 -0.369984 0.166968 0.139378 0.174792 0.246553 0.212174 0.216604 0.221029 0.213162 0.286815 0.205577 0.195635 0.205420 0.199254 0.191862 0.201692 0.195147 0.195107 0.363844 0.366272
chargesum: 0.00000
title: Mulliken charges with hydrogens summed into heavy atoms:
elementType: O O O N N C C C C C C C C C C C
charge: -0.205156 -0.205088 -0.217875 -0.008309 -0.001577 0.237234 0.005750 -0.018740 -0.060114 -0.022416 -0.006869 0.001753 0.020270 0.166968 0.139378 0.174792
polarizability: 1.63262155e+02 -9.87487957e+00 1.27590499e+02 -1.68207054e+01 -3.09804464e+00 1.18252859e+02
1716.lowfreq: -18.6509 -8.3815 -0.0008 0.0005 0.0006 12.4399 29.3896 44.5699 63.7161
frequency: 27.9729 43.3644 63.7007 123.5315 140.1894 145.3882 152.3653 171.2794 199.6225 276.9431 314.5502 334.3577 350.7108 358.4995 368.7842 432.6548 472.8963 479.5199 491.2450 500.5139 583.0217 605.8797 650.9719 687.5427 710.7269 736.9318 754.1404 784.0886 800.5074 816.9397 824.1439 859.9771 875.0022 898.9262 943.6408 952.2363 985.5614 996.6001 1005.0183 1026.7811 1044.8345 1058.7183 1126.2931 1138.5743 1165.9527 1192.4432 1195.9442 1207.2196 1214.8034 1257.3158 1269.2213 1276.6386 1282.3139 1308.6653 1315.5928 1328.4562 1336.3196 1342.6256 1349.2233 1353.4535 1361.1637 1365.0164 1373.0743 1375.2272 1376.6229 1459.7498 1461.8494 1465.3861 1466.6379 1474.3999 1481.7957 1625.9041 1652.6006 1676.4552 2956.5903 2957.3518 2961.4039 2969.1643 2974.7663 2982.5672 2994.1709 3009.1698 3016.4249 3022.4681 3030.2362 3032.1604 3035.1798 3052.1394 3518.9395 3521.4952
redmass: 6.5859 4.3475 3.7213 5.1660 2.8426 5.6099 2.8451 7.0463 3.1252 2.2679 2.3222 3.5685 3.4310 4.9967 7.8498 2.3070 8.5192 4.8680 2.0942 2.7640 4.2923 7.5666 3.0233 2.6859 1.9668 3.2304 1.6559 1.6823 2.4248 1.8531 1.5346 2.2285 2.4016 3.3731 3.3453 2.2338 3.6986 3.1323 1.5578 2.0652 1.5259 2.2758 2.0946 2.4052 1.4353 1.2864 1.5558 1.3992 2.5973 1.2944 1.2746 1.2199 1.2011 2.7532 1.3581 1.3164 1.3885 1.4190 1.4923 1.3717 1.8481 3.1032 1.4171 1.5454 2.1359 1.0815 1.0846 1.0889 1.0865 1.0869 1.0861 6.6840 8.8256 5.5703 1.0588 1.0594 1.0654 1.0631 1.0662 1.0808 1.0665 1.0989 1.0951 1.0992 1.0994 1.0843 1.1012 1.1010 1.0761 1.0778
irintensity: 0.7699 0.0956 0.1753 5.9348 0.3961 0.5044 1.6641 4.9008 1.3784 1.5709 0.9013 0.7351 10.1286 19.3678 10.2317 1.3017 13.1758 14.8038 10.9815 15.7210 6.5944 0.8755 0.2263 25.7067 0.6162 13.4001 1.2264 174.9692 50.2978 4.2178 7.5730 1.6834 1.8053 1.5409 0.7287 2.8954 3.6163 6.5728 1.6544 10.9360 1.8347 5.5430 0.3046 11.9868 22.1128 8.5512 35.4858 6.4838 49.9901 10.3408 14.7006 1.5128 2.6982 264.6024 53.1591 27.6896 0.0752 6.4337 5.3338 0.6584 67.1609 123.9564 2.6111 20.3187 9.7620 2.2064 13.9469 1.9705 8.2041 13.8023 16.9746 328.2340 104.1113 599.2722 44.0058 19.1801 30.0368 23.9916 26.7085 2.6655 16.7456 43.7502 33.3213 42.7133 55.6326 0.2785 88.9856 49.9945 81.0499 49.7433
temp: 298.150 k
press: 1.00000 atm
elementType: 8 8 8 7 7 6 6 6 6 6 6 6 6 6 6 6 1 1 1 1 1 1 1 1 1 1 1 1 1 1 1 1
symmnumber: 1
zpe: 695996.0 jmol-1
zpe.correction: 0.265091 hartree
zpe.thermalcorrener: 0.279762 hartree
zpe.thermalcorrenthalpy: 0.280706 hartree
zpe.thermalcorrgfe: 0.222634 hartree
zpe.sumelectzpe: -762.770923 hartree
zpe.sumelectthermal: -762.756252 hartree
zpe.sumelectthermalent: -762.755308 hartree
zpe.sumelectthermalfe: -762.813380 hartree
dipole: -1.7193 -0.2478 -0.5273
dipole: 1.8153
quadrupole: -99.2095 -102.9808 -100.0225
quadrupole: 2.2003 4.4616 2.8543
quadrupole: 1.5281 -2.2432 0.7151 2.2003 4.4616 2.8543
hfenergy: -763.0360143 hartree
pointgroup: C01 [X(C11H16N2O3)]
dipole: -0.6870694 -0.0217976 -0.1937866 debye
polarizability: 161.1655388|-5.0073078|128.671648|-21.1090532|0.5965764|119.2683255 unknown
InChI: InChI=1S/C11H16N2O3/c14-9-8(10(15)13-11(16)12-9)7-5-3-1-2-4-6-7/h7-8,12-13H,1-6H2
charge 0 multiplicity 1
32 atoms
O  0.860629 2.530373 0.667047
O  1.059855 -2.233978 1.508185
O  3.898128 -0.191735 -1.561041
N  2.298564 1.129755 -0.480947
N  2.430086 -1.190678 -0.039127
C  -0.897932 -0.100741 0.491854
C  -1.844214 1.053582 0.924762
C  -0.896112 -0.404437 -1.032915
C  0.582921 0.117729 1.028631
C  -3.275097 0.548754 1.247465
C  -2.287164 -0.370089 -1.723403
C  -4.127906 0.103436 0.035883
C  -3.47538 -0.942214 -0.904854
C  1.236604 1.355607 0.421094
C  1.362592 -1.187431 0.879224
C  2.937631 -0.09259 -0.758795
H  -1.227603 -1.015267 1.025637
H  -1.874749 1.844156 0.151164
H  -1.435031 1.541253 1.829375
H  -0.444059 -1.405323 -1.186249
H  -0.241584 0.319825 -1.560151
H  0.482917 0.306382 2.113839
H  -3.822103 1.354119 1.777699
H  -3.193634 -0.294154 1.965428
H  -2.1956 -0.921587 -2.67978
H  -2.535625 0.674519 -1.998437
H  -4.386233 0.994784 -0.573335
H  -5.087653 -0.299696 0.41786
H  -3.157509 -1.835968 -0.329535
H  -4.251116 -1.29462 -1.612998
H  2.703011 1.954392 -0.937243
H  2.920164 -2.079759 -0.183438
