program: Gaussian 09
title: 000231690
version: EM64L-G09RevD.01
frameworkgroup: C1[X(C20H14O3)]
method: RPBEPBE
basis: SDD
operation: Freq
keyword: #pfreq=noraman
keyword: PBEPBE/SDD
title: #p freq=noraman PBEPBE/SDD
converged: YES YES NO NO
title: Mulliken charges:
elementType: O O O C C C C C C C C C C C C C C C C C C C C H H H H H H H H H H H H H H
charge: -0.282232 -0.454658 -0.244811 -0.500129 0.354563 0.364751 0.486374 0.084847 0.094242 0.026730 -0.384154 -0.386543 -0.357016 -0.363111 -0.364521 -0.250909 -0.255649 -0.334833 -0.225366 -0.223550 -0.233257 -0.244735 0.073897 0.311317 0.260091 0.235594 0.248917 0.257088 0.257750 0.226452 0.228529 0.274171 0.230567 0.231227 0.233743 0.237739 0.386886
chargesum: 0.00000
title: Mulliken charges with hydrogens summed into heavy atoms:
elementType: O O O C C C C C C C C C C C C C C C C C C C C
charge: -0.282232 -0.067772 -0.244811 -0.188812 0.354563 0.364751 0.486374 0.084847 0.094242 0.026730 -0.124063 -0.150949 -0.108099 -0.106023 -0.106771 -0.024457 -0.027121 -0.060662 0.005201 0.007678 0.000486 -0.006996 0.073897
polarizability: 2.51944614e+02 -1.52621171e+00 2.40515582e+02 -1.96605139e+01 -1.23396371e+00 1.71513784e+02
1716.lowfreq: -2.0083 -0.0005 -0.0003 -0.0002 7.3047 10.8721 22.9246 32.8981 39.9120
frequency: 22.5475 32.6771 39.9001 58.4472 74.8219 114.0893 129.7318 146.2985 199.6608 223.6662 236.4846 270.2734 282.8743 308.6589 361.8206 375.2824 394.3765 412.1348 453.0224 454.6289 489.7395 508.4366 521.6744 523.6953 575.2509 590.8906 597.5811 601.5081 615.8326 623.9886 663.5539 695.9972 702.7122 725.0652 726.7306 755.8370 760.9129 764.8603 771.6128 787.3577 824.1658 829.9493 866.6456 868.4434 872.4440 882.4836 904.0917 948.5561 953.8796 975.6111 981.2768 983.0025 999.3405 1002.2040 1031.0276 1033.1153 1056.7261 1077.3788 1087.9501 1107.1426 1162.9510 1166.9012 1167.1382 1169.9833 1180.1728 1182.3124 1196.4269 1212.3261 1222.7277 1237.5350 1247.9371 1283.3026 1298.1690 1315.7237 1323.1113 1383.9642 1387.6127 1390.9246 1435.9034 1438.8515 1447.2087 1473.3394 1474.3483 1482.0937 1571.4524 1581.0549 1602.2630 1607.9232 1609.0315 1629.9465 1632.9184 3070.0700 3121.9087 3131.1292 3132.0700 3139.3642 3143.4550 3144.8209 3155.9124 3157.9040 3158.2884 3171.7095 3171.8327 3172.3378 3502.9737
redmass: 7.3984 5.3710 6.5183 6.3583 5.1258 4.0715 4.0838 7.4494 5.5695 5.1299 5.0893 5.7785 4.7383 5.5267 6.4509 7.0549 4.8531 3.4683 3.6901 3.1699 4.8348 5.2207 4.1211 4.0864 4.9087 5.9454 3.9460 1.3990 6.0611 5.3888 6.2140 3.4198 4.0208 3.7191 5.9879 2.4376 1.5321 1.2974 3.5882 1.9331 3.1902 3.4058 1.4715 5.2384 1.5814 2.4143 2.4013 1.3972 1.3915 1.4003 1.3155 1.3301 5.2103 1.3575 2.2706 2.0120 2.3051 2.7414 2.2543 2.1828 1.6912 1.8093 1.0788 1.2336 1.1031 2.2633 2.2481 2.7930 1.4640 2.6337 1.4180 1.4599 2.2882 1.5043 1.7226 6.0139 6.1999 8.0642 2.2421 2.3902 2.5178 2.5165 2.3985 2.6544 6.5646 6.4911 7.3832 6.0336 6.9576 7.6499 7.7609 1.0828 1.0881 1.0860 1.0854 1.0884 1.0903 1.0897 1.0945 1.0941 1.0948 1.1002 1.0999 1.0999 1.0638
irintensity: 1.1066 0.7878 0.0709 0.8489 0.6213 0.0997 0.3349 1.0228 2.7495 2.0220 1.2771 0.6785 0.4070 0.0364 5.3619 2.3116 0.0996 7.0683 15.6910 0.0572 0.7701 5.8326 1.9951 2.2801 2.8546 15.8613 26.3238 59.1664 7.0902 7.7261 1.1543 65.7880 21.4085 10.2351 2.2191 26.2881 129.9255 9.0148 20.9674 22.4549 2.5055 29.8398 1.6882 0.1829 3.9938 10.6916 6.9412 1.1334 0.4683 1.9492 0.7318 3.5957 184.0749 2.6190 0.8257 14.3915 10.8686 33.0883 28.4552 20.8219 65.4704 23.1487 1.0528 3.4664 0.8288 6.6545 96.0274 3.0994 21.9556 222.6946 23.7355 2.6207 54.1411 9.8355 14.4851 9.3221 4.1324 0.9524 24.6236 75.7797 13.4518 132.6109 40.7366 2.0453 1.9053 40.9520 2.8431 77.6361 11.1308 129.7288 169.5984 10.6499 4.5658 2.0059 0.8255 9.1728 8.6005 8.8608 7.4326 22.6860 13.9613 22.7862 26.4869 9.1054 39.9839
temp: 298.150 k
press: 1.00000 atm
elementType: 8 8 8 6 6 6 6 6 6 6 6 6 6 6 6 6 6 6 6 6 6 6 6 1 1 1 1 1 1 1 1 1 1 1 1 1 1
symmnumber: 1
zpe: 740305.4 jmol-1
zpe.correction: 0.281967 hartree
zpe.thermalcorrener: 0.299805 hartree
zpe.thermalcorrenthalpy: 0.300749 hartree
zpe.thermalcorrgfe: 0.234654 hartree
zpe.sumelectzpe: -994.647329 hartree
zpe.sumelectthermal: -994.629492 hartree
zpe.sumelectthermalent: -994.628548 hartree
zpe.sumelectthermalfe: -994.694643 hartree
dipole: -0.3722 0.2496 0.5137
dipole: 0.6817
quadrupole: -136.6757 -121.2029 -122.6760
quadrupole: 3.4965 0.3629 -2.3340
quadrupole: -9.8242 5.6486 4.1755 3.4965 0.3629 -2.3340
hfenergy: -994.9292964 hartree
pointgroup: C01 [X(C20H14O3)]
dipole: 0.1326543 -0.1080435 0.206565 debye
polarizability: 248.5513425|-2.9799757|240.0133773|25.3858046|5.5834181|175.4092609 unknown
InChI: InChI=1S/C20H14O3/c21-20(22)14-8-2-1-7-13(14)19-15-9-3-5-11-17(15)23-18-12-6-4-10-16(18)19/h1-12,19,21H
charge 0 multiplicity 1
37 atoms
O  2.69366 -0.069409 0.726928
O  -2.17875 -0.694509 -2.346604
O  -4.238925 0.197607 -1.813695
C  0.005508 -0.010503 -0.554937
C  0.817066 -1.292867 -0.3456
C  0.870144 1.23342 -0.337656
C  -1.218234 0.014542 0.393091
C  2.07798 -1.271263 0.29599
C  2.132721 1.157003 0.296465
C  -2.585166 -0.004214 -0.028647
C  0.311513 -2.54982 -0.759408
C  0.417122 2.51253 -0.743243
C  -0.956607 0.108674 1.785675
C  2.809847 -2.451596 0.546588
C  2.916631 2.304828 0.542679
C  1.027845 -3.741841 -0.523636
C  1.184072 3.673298 -0.512002
C  -3.627359 0.099494 0.941497
C  2.278858 -3.691524 0.139401
C  2.437421 3.567056 0.140193
C  -1.990358 0.182841 2.737415
C  -3.340608 0.186279 2.312871
C  -3.086765 -0.12291 -1.430966
H  -0.365313 -0.006692 -1.590766
H  -0.659315 -2.5787 -1.266609
H  -0.56017 2.593981 -1.234745
H  0.085045 0.131433 2.124203
H  3.780038 -2.375745 1.046762
H  3.885736 2.186501 1.036683
H  0.615689 -4.702592 -0.849563
H  0.810135 4.65132 -0.832068
H  -4.661574 0.106586 0.582969
H  2.840963 -4.611815 0.331336
H  3.040316 4.461926 0.328214
H  -1.746915 0.246784 3.803719
H  -4.154332 0.254867 3.042135
H  -2.626918 -0.740971 -3.235171
