program: Gaussian 09
title: 000231663
version: EM64L-G09RevD.01
frameworkgroup: C1[X(C4H5N3O)]
method: RPBEPBE
basis: SDD
operation: Freq
keyword: #pfreq=noraman
keyword: PBEPBE/SDD
title: #p freq=noraman PBEPBE/SDD
converged: NO YES NO NO
title: Mulliken charges:
elementType: O N N N C C C C H H H H H
charge: -0.294490 -0.635842 -0.574586 -0.041524 0.185145 0.177176 -0.191154 -0.292130 0.296700 0.344562 0.337032 0.355902 0.333207
chargesum: 0.00000
title: Mulliken charges with hydrogens summed into heavy atoms:
elementType: O N N N C C C C
charge: -0.294490 0.045753 0.114523 -0.041524 0.185145 0.177176 0.105546 -0.292130
polarizability: 8.69425228e+01 4.92507051e+00 8.91339683e+01 -2.14448217e-04 -1.31902324e-03 2.80744998e+01
1716.lowfreq: -12.3432 -11.3155 -6.0357 0.0003 0.0003 0.0004 80.6124 124.2135 184.6848
frequency: 80.5932 124.2105 184.6847 194.1269 275.2882 402.5591 419.2282 488.1132 515.5329 532.0883 552.1459 595.2090 617.5853 648.8154 727.5265 736.1417 989.1405 1049.6357 1072.4715 1134.2545 1292.1339 1341.9642 1371.2975 1576.0552 1614.5500 1639.0983 1672.6591 2132.8550 3145.6293 3519.3862 3523.2525 3674.3536 3675.6699
redmass: 5.8341 7.3650 4.4429 5.0164 2.0967 5.0691 4.0927 1.6789 9.2590 1.1306 1.3514 1.4546 3.6411 2.1457 3.8039 6.5531 1.2900 1.7182 2.0663 2.6980 1.6958 2.6645 4.8406 2.6131 1.5372 1.7338 2.7073 12.5773 1.0931 1.0453 1.0479 1.1019 1.1042
irintensity: 23.7169 7.7708 15.0652 1.1394 1.3235 5.3416 3.4042 31.7774 0.6851 245.6510 1.6790 305.0536 22.8496 19.3477 0.6418 58.2182 23.4901 16.5037 4.9720 45.1459 138.7849 0.0525 203.7203 239.9852 7.5995 200.7054 430.3714 88.4164 3.1435 78.2712 64.5851 57.3383 40.8265
temp: 298.150 k
press: 1.00000 atm
elementType: 8 7 7 7 6 6 6 6 1 1 1 1 1
symmnumber: 1
zpe: 248334.3 jmol-1
zpe.correction: 0.094586 hartree
zpe.thermalcorrener: 0.102730 hartree
zpe.thermalcorrenthalpy: 0.103674 hartree
zpe.thermalcorrgfe: 0.061875 hartree
zpe.sumelectzpe: -394.320949 hartree
zpe.sumelectthermal: -394.312805 hartree
zpe.sumelectthermalent: -394.311861 hartree
zpe.sumelectthermalfe: -394.353660 hartree
dipole: -2.5654 -1.3568 0.0010
dipole: 2.9020
quadrupole: -31.6838 -53.8736 -49.1570
quadrupole: 17.5703 0.0001 0.0014
quadrupole: 13.2210 -8.9688 -4.2522 17.5703 0.0001 0.0014
hfenergy: -394.4155343 hartree
pointgroup: C01 [X(C4H5N3O1)]
dipole: 0.8476489 -0.7649068 -0.0003754 debye
dipolederiv: -0.956597 -0.2819147 0.0000725 -0.3078847 -0.8673182 0.0001019 0.0000557 0.0000242 -0.3890343 -0.5947749 0.4394107 -0.0000643 0.4812755 -0.9578239 -0.0000121 -0.0000405 0.0000104 -0.7106573 -1.2126819 0.9316396 -0.0000086 0.236053 -0.3370106 -0.0000763 0.0000611 -0.0001348 -0.6701166 -0.3318389 -0.1965071 0.0001392 -0.1513027 -0.5546299 0.0002128 -0.0000723 -0.0000469 -0.2663333 -0.8455073 0.1101689 0.0000163 0.3429204 -0.7931694 -0.0000093 0.0000613 0.0000834 -0.0844968 1.873298 -0.2124779 -0.000081 -0.1419248 1.3713611 -0.0001499 -0.0001341 -0.0000504 0.2681038 1.0803979 -1.0355217 -0.0000274 -0.6697257 0.7371307 0.0000161 -0.0000026 0.0000825 0.0875556 0.0016994 0.4295625 -0.0001205 0.3821794 0.5876139 -0.0002133 0.0000556 -0.0000806 0.0273683 0.1463508 -0.0464287 0.0000148 -0.0328339 0.0792993 0.0000128 -0.0000119 0.0000077 0.1633364 0.1876638 -0.0445948 0.0000217 -0.0676778 0.1894169 0.0000252 0.0000076 0.0000272 0.3930737 0.2012722 -0.0381194 0.0000139 -0.0226064 0.1847304 0.0000322 -0.0000001 0.0000353 0.3901025 0.2418239 -0.0475565 0.0000068 0.0209359 0.1074029 0.0000327 -0.0000009 0.000036 0.3923415 0.2088941 -0.0076609 0.0000167 -0.0694082 0.2529968 0.0000273 0.0000213 0.0000059 0.3987567 unknown
polarizability: 84.7333353|-3.8124135|91.3431558|0.0001154|0.0013313|28.0744998 unknown
InChI: InChI=1S/C4H5N3O/c5-1-3(2-6)4(7)8/h1H,5,7H2
charge 0 multiplicity 1
13 atoms
O  -2.071402 -1.147327 0.00034
N  -1.941325 1.175383 0.000072
N  2.072667 -1.621454 0.000028
N  1.566566 2.074351 0.000386
C  0.128062 -0.124327 0.000069
C  -1.371869 -0.085196 0.000242
C  0.730361 -1.375999 0.000145
C  0.909356 1.067354 -0.000159
H  0.055216 -2.240393 0.000311
H  -1.380179 2.026647 -0.0001
H  -2.957604 1.241518 0.000097
H  2.746453 -0.854241 -0.000129
H  2.428998 -2.573617 0.000101
