program: Gaussian 09
title: 000231689
version: EM64L-G09RevD.01
frameworkgroup: C1[X(C19H20O4)]
method: RPBEPBE
basis: SDD
operation: Freq
keyword: #pfreq=noraman
keyword: PBEPBE/SDD
title: #p freq=noraman PBEPBE/SDD
converged: YES YES NO NO
title: Mulliken charges:
elementType: O O O O C C C C C C C C C C C C C C C C C C C H H H H H H H H H H H H H H H H H H H H
charge: -0.266997 -0.266995 -0.210735 -0.210797 -0.086256 0.348485 0.348561 0.197230 0.197153 -0.335086 -0.335035 -0.350976 -0.350952 -0.249985 -0.249990 -0.255248 -0.255272 -0.246300 -0.246310 -0.260636 -0.260591 -0.670227 -0.670197 0.236174 0.236181 0.263878 0.263847 0.224727 0.224728 0.227033 0.227031 0.228477 0.228479 0.237167 0.224634 0.237147 0.224629 0.224529 0.257990 0.219005 0.257973 0.224527 0.218997
chargesum: 0.00000
title: Mulliken charges with hydrogens summed into heavy atoms:
elementType: O O O O C C C C C C C C C C C C C C C C C C C
charge: -0.266997 -0.266995 -0.210735 -0.210797 -0.086256 0.348485 0.348561 0.197230 0.197153 -0.098911 -0.098854 -0.087097 -0.087105 -0.025259 -0.025262 -0.028214 -0.028241 -0.017823 -0.017830 0.201166 0.201185 0.031297 0.031300
polarizability: 2.33845795e+02 -2.76605938e+01 1.95583686e+02 1.76596783e-02 1.54195539e-02 2.03592771e+02
1716.lowfreq: -6.4901 -0.0006 -0.0002 0.0005 8.0017 8.8404 20.4334 25.9954 34.1144
frequency: 20.4060 23.3730 33.0648 43.8170 48.2257 56.0721 80.5926 83.5292 92.4177 93.6984 115.8015 159.3637 161.0224 199.8462 204.4403 228.6571 245.8590 259.4143 265.8415 285.7076 307.7041 316.0113 358.8865 373.1223 400.8587 408.5818 416.2155 444.1297 500.3204 504.4969 573.6143 616.4770 618.0970 646.9172 685.6869 690.6389 695.1204 707.4974 708.3675 729.8508 756.1264 778.3503 787.2253 812.1681 813.7085 832.8368 847.9978 851.4257 912.8390 919.0589 924.1738 956.3226 960.1542 976.3496 979.0439 992.1258 992.7346 994.3679 995.8604 1010.9457 1022.0286 1032.4610 1032.7655 1087.1674 1092.5600 1095.9555 1096.3860 1153.5286 1153.8300 1155.6968 1158.5836 1171.9203 1174.6250 1175.0203 1198.9887 1201.3261 1208.9189 1275.8785 1276.1131 1323.4489 1331.1198 1352.8380 1353.2524 1375.1889 1380.5735 1388.7754 1388.8646 1434.1563 1440.9067 1454.7820 1455.2524 1462.1239 1462.2105 1481.8478 1483.0145 1484.0584 1484.1544 1587.2384 1593.0427 1608.4430 1609.3684 1614.0551 1646.6146 2992.0603 2992.1152 3029.9693 3030.0481 3086.3255 3086.3576 3094.1935 3094.2907 3120.2625 3120.3504 3124.8341 3124.9803 3135.6242 3136.1202 3149.8591 3150.8194 3160.6390 3161.4634 3172.4412 3172.7657
redmass: 2.9521 3.0074 3.6372 3.7848 3.8566 3.8222 4.2810 4.2118 5.6998 3.8198 5.1166 4.3879 2.9086 1.6288 1.3389 3.2065 3.8420 3.6721 5.9826 5.7283 3.1225 3.1431 8.9180 5.9225 2.7745 2.8263 3.5587 3.5711 3.4830 3.6629 8.6089 6.4090 6.3323 6.3399 5.2770 4.5212 3.3037 1.8183 1.7825 3.2117 2.3231 2.1973 2.8188 1.3638 1.4137 3.4246 1.2537 1.2619 3.5297 1.9180 1.5664 3.0584 4.9517 1.4064 1.3920 4.0159 4.8065 1.4950 1.4013 2.7714 3.8745 2.2824 2.1816 1.7885 1.6657 2.1108 2.0997 2.2503 1.7547 2.8302 5.9777 2.9708 1.0580 1.1296 1.1453 1.1190 4.1952 1.1163 1.1187 1.3884 1.2961 1.2716 1.2710 6.4507 9.1062 1.2315 1.2320 2.2592 2.2696 1.0986 1.0950 1.0440 1.0441 2.1051 2.1479 1.0606 1.0508 5.9076 6.2916 5.9171 6.0739 10.1935 10.3820 1.0360 1.0360 1.0595 1.0595 1.0974 1.0974 1.1028 1.1028 1.1063 1.1063 1.0848 1.0848 1.0888 1.0889 1.0936 1.0933 1.0971 1.0966 1.0981 1.0982
irintensity: 0.4345 0.4952 0.9158 0.5446 1.4898 0.0759 0.9325 1.9449 0.5397 0.1376 0.0487 0.0588 2.1359 2.5354 0.0845 0.6871 0.7086 0.5037 1.8310 0.6797 20.3259 0.2574 11.3283 3.4942 0.0000 0.0042 1.6490 0.5351 15.3374 0.5132 15.2908 0.3268 0.2085 22.0342 8.0668 1.1335 5.5631 24.4363 109.8704 16.2315 19.5308 7.8445 14.7039 0.0473 8.0818 4.9088 0.0901 0.3479 1.5067 6.3741 0.0428 64.6668 0.0760 0.3052 0.6104 0.6523 0.2837 0.4941 0.0097 21.9955 310.4870 2.4424 17.4249 47.6177 2.1250 23.7141 0.6193 268.6845 2.1930 167.6347 41.0765 0.3097 3.0543 0.0054 5.9240 0.1870 40.3115 7.0839 0.2115 3.3854 0.0459 0.1534 0.8473 0.3356 0.5052 24.0655 31.7748 5.6156 7.4164 18.8246 4.5629 14.3353 16.6455 16.1496 35.5782 4.6369 20.8758 0.5059 2.9031 3.2058 12.6216 64.8082 206.4725 25.4432 12.7288 46.7341 4.7376 64.5088 10.9254 1.7569 1.7798 27.0388 23.9565 0.2298 0.1837 7.4645 11.6591 59.9024 4.2662 14.3542 33.3174 16.1683 0.5753
temp: 298.150 k
press: 1.00000 atm
elementType: 8 8 8 8 6 6 6 6 6 6 6 6 6 6 6 6 6 6 6 6 6 6 6 1 1 1 1 1 1 1 1 1 1 1 1 1 1 1 1 1 1 1 1
symmnumber: 1
zpe: 900741.2 jmol-1
zpe.correction: 0.343074 hartree
zpe.thermalcorrener: 0.365637 hartree
zpe.thermalcorrenthalpy: 0.366581 hartree
zpe.thermalcorrgfe: 0.288594 hartree
zpe.sumelectzpe: -1035.240193 hartree
zpe.sumelectthermal: -1035.217630 hartree
zpe.sumelectthermalent: -1035.216686 hartree
zpe.sumelectthermalfe: -1035.294673 hartree
dipole: 0.0000 -0.0024 1.9938
dipole: 1.9938
quadrupole: -113.7256 -123.1891 -136.8253
quadrupole: 5.7349 -0.0002 0.0041
quadrupole: 10.8544 1.3909 -12.2453 5.7349 -0.0002 0.0041
hfenergy: -1035.5832671 hartree
pointgroup: C01 [X(C19H20O4)]
dipole: -0.0038721 -0.0051978 0.7843959 debye
polarizability: 181.1929289|-2.7166213|248.2353144|-0.0813205|0.2509771|203.5940081 unknown
InChI: InChI=1S/C19H20O4/c1-3-22-17(20)19(18(21)23-4-2,15-11-7-5-8-12-15)16-13-9-6-10-14-16/h5-14H,3-4H2,1-2H3
charge 0 multiplicity 1
43 atoms
O  2.213562 -0.966726 -0.344733
O  -2.197585 1.000356 -0.350153
O  1.430227 0.461696 -2.007461
O  -1.401546 -0.410161 -2.022071
C  0.007151 0.015881 -0.023955
C  0.401351 1.252928 0.824049
C  -0.393205 -1.229587 0.808785
C  1.252602 -0.157574 -0.937743
C  -1.231824 0.198216 -0.944836
C  0.175335 2.569911 0.352434
C  -0.165715 -2.54168 0.324426
C  1.144713 1.073432 2.018191
C  -1.143408 -1.062091 2.000363
C  0.646829 3.683283 1.080781
C  -0.642848 -3.662272 1.037852
C  1.616373 2.186306 2.747011
C  -1.620656 -2.182195 2.714322
C  1.364123 3.498295 2.284849
C  -1.367172 -3.489426 2.239521
C  3.528461 -1.062206 -1.057525
C  -3.508285 1.100697 -1.069985
C  3.487243 -2.156336 -2.127294
C  -3.462823 2.205371 -2.128681
H  -0.367846 2.729389 -0.583091
H  0.382974 -2.69167 -0.609469
H  1.364127 0.060292 2.370133
H  -1.363699 -0.052529 2.361879
H  0.458214 4.695115 0.704933
H  -0.453082 -4.670222 0.652272
H  2.185762 2.028063 3.669762
H  -2.195317 -2.033225 3.635348
H  1.729823 4.363595 2.849132
H  -1.73724 -4.360319 2.792227
H  3.756485 -0.075873 -1.498379
H  4.238573 -1.295005 -0.24829
H  -3.731957 0.11836 -1.521855
H  -4.223633 1.324297 -0.262756
H  3.209829 -3.129836 -1.686963
H  2.765475 -1.900187 -2.920705
H  4.486024 -2.260508 -2.590697
H  -2.736637 1.958096 -2.920892
H  -3.189053 3.174834 -1.677308
H  -4.45933 2.312811 -2.596228
