program: Gaussian 09
title: 000231676
version: EM64L-G09RevD.01
frameworkgroup: C1[X(C17H21N3O)]
method: RPBEPBE
basis: SDD
operation: Freq
keyword: #p
keyword: freq=noraman
keyword: PBEPBE/SDD
title: #p freq=noraman PBEPBE/SDD
converged: YES YES NO NO
title: Mulliken charges:
elementType: O N N N C C C C C C C C C C C C C C C C C H H H H H H H H H H H H H H H H H H H H H
charge: -0.273448 -0.352040 -0.374085 -0.633851 -0.108490 -0.435371 -0.498990 -0.484329 0.201751 0.427827 0.443240 -0.460067 -0.366930 -0.446767 -0.355610 -0.221486 -0.226218 -0.219359 -0.228232 -0.245495 -0.235755 0.196639 0.250223 0.196622 0.244943 0.181128 0.285744 0.273473 0.233290 0.206590 0.230298 0.270589 0.234370 0.233022 0.311305 0.386864 0.221464 0.222057 0.229455 0.229239 0.224256 0.232134
chargesum: 0.00000
title: Mulliken charges with hydrogens summed into heavy atoms:
elementType: O N N N C C C C C C C C C C C C C C C C C
charge: -0.273448 -0.107097 -0.100612 0.064318 0.088149 0.011474 -0.032118 -0.044449 0.201751 0.427827 0.443240 -0.229768 -0.096341 -0.212397 -0.122588 -0.000022 -0.004162 0.010096 0.001007 -0.021240 -0.003621
polarizability: 2.90552262e+02 1.66437514e+01 1.74293139e+02 -2.07235916e+01 4.23195117e+00 1.51448662e+02
1716.lowfreq: -14.8862 -5.9985 -3.4051 -1.8529 -0.0009 -0.0005 0.0003 16.9018 20.6200
frequency: -6.7865 16.6873 20.2102 28.8850 37.9723 54.7069 63.3746 87.8717 141.1079 145.8244 185.7806 194.3658 224.1764 259.1095 275.4882 308.6164 314.9164 335.3674 388.7027 403.8549 404.9355 429.9635 473.4591 488.7418 509.9405 544.5897 586.6829 609.8824 611.2351 617.0994 617.7681 673.2278 693.2246 703.2769 705.1394 743.3381 751.7234 764.8397 784.6407 812.7663 822.6039 852.8310 855.8692 914.3970 916.5954 929.9572 958.5544 962.2989 977.1426 977.8683 984.9019 990.0879 990.8949 995.8413 997.6787 1023.1237 1025.5813 1031.0549 1064.5563 1080.6825 1087.0468 1109.4822 1117.0898 1132.8581 1162.7233 1169.3286 1173.0078 1178.0182 1181.3227 1185.9709 1207.2943 1216.8642 1224.4033 1252.1578 1276.0162 1289.0114 1308.4297 1318.3250 1326.4479 1346.6881 1354.1707 1379.2575 1386.5498 1389.6683 1437.0875 1439.4499 1440.0084 1465.0673 1477.4593 1479.4124 1482.3182 1487.6734 1489.3675 1581.8074 1592.7376 1595.2527 1614.4309 1615.2383 1633.5373 2782.0790 2861.1178 2891.6669 2909.6090 2999.4669 3035.9410 3041.6549 3111.5051 3119.0256 3122.0034 3124.8169 3135.6585 3137.1451 3148.6445 3151.2740 3155.5763 3162.7638 3165.5369 3412.8579 3431.0892 3597.4350
redmass: 4.1686 4.1416 4.5143 4.3487 4.7085 5.0950 4.9770 4.1733 3.4709 4.3426 5.4345 3.0958 3.3033 3.4157 2.8834 4.1027 3.4693 3.2749 3.3805 2.8093 2.8307 3.4737 3.0534 3.4574 3.5218 3.3035 2.1181 2.6877 2.2617 5.8252 4.2371 2.1027 3.4416 1.8818 1.8821 1.4526 1.7368 1.5130 2.5173 3.7526 3.6633 1.2458 1.2475 1.3695 1.3846 1.2033 1.6642 2.3116 1.3891 1.3875 1.8833 4.4668 5.1079 1.4751 1.3241 2.6254 2.1769 2.5253 2.1715 1.5565 1.5790 3.5905 2.9947 2.1842 1.7691 1.0564 1.0628 1.5167 1.1140 1.1100 1.3492 2.4785 1.9252 1.3348 1.1470 1.5181 1.4527 1.3166 1.3817 1.7480 1.5431 2.4472 5.4517 2.7842 1.1910 2.1539 2.1409 1.1678 1.1393 1.8109 1.8524 1.2868 1.2313 1.1869 6.1597 6.0508 6.1335 6.1498 7.8829 1.0784 1.0717 1.0709 1.0682 1.0916 1.0863 1.0901 1.0864 1.0873 1.0868 1.0863 1.0926 1.0913 1.0961 1.0957 1.0690 1.1002 1.1015 1.0744 1.0743 1.0862
irintensity: 0.0231 0.0361 0.2034 0.3880 2.5972 1.9064 0.2767 1.6960 4.2864 3.2324 2.1785 4.6843 6.2511 0.5799 4.5053 8.0793 0.0941 13.7813 0.8862 0.1786 0.2707 8.1678 2.7311 17.1425 24.4457 21.3506 21.2125 73.8616 11.5305 6.4225 2.6779 107.4977 3.9455 58.8623 41.0180 86.4870 34.7516 31.9762 9.6815 1.5773 5.0168 0.7485 0.0863 9.2182 2.9718 121.3919 10.6080 2.2543 0.6243 0.7002 13.1948 0.9451 0.1032 1.5044 0.1296 2.1119 24.1466 2.0069 5.6125 13.0948 9.9870 17.1748 26.6185 48.9133 62.3580 0.3941 0.4482 2.7803 1.7872 0.1654 21.8153 5.6666 57.0000 6.6863 18.5676 49.4558 9.9800 3.0917 7.4408 12.8645 2.8396 2.8557 1.7258 2.3688 53.0747 8.7548 12.7863 41.0311 8.6903 17.5230 19.6670 10.2090 0.9073 113.4830 1.0573 0.3782 21.4577 2.0313 368.7873 112.2647 98.2073 80.6677 94.1597 19.1127 27.8061 16.1239 9.1498 7.6043 0.9570 8.3162 34.6641 20.1408 61.4336 39.2757 558.9953 16.1634 14.3845 0.8851 1.9105 48.0658
temp: 298.150 k
press: 1.00000 atm
elementType: 8 7 7 7 6 6 6 6 6 6 6 6 6 6 6 6 6 6 6 6 6 1 1 1 1 1 1 1 1 1 1 1 1 1 1 1 1 1 1 1 1 1
symmnumber: 1
zpe: 917929.7 jmol-1
zpe.correction: 0.349621 hartree
zpe.thermalcorrener: 0.368562 hartree
zpe.thermalcorrenthalpy: 0.369506 hartree
zpe.thermalcorrgfe: 0.298797 hartree
zpe.sumelectzpe: -898.340334 hartree
zpe.sumelectthermal: -898.321393 hartree
zpe.sumelectthermalent: -898.320449 hartree
zpe.sumelectthermalfe: -898.391158 hartree
dipole: 5.1970 -3.6563 -0.7363
dipole: 6.3968
quadrupole: -117.4342 -126.5808 -122.0990
quadrupole: 10.0179 -1.4834 0.9601
quadrupole: 4.6038 -4.5428 -0.0610 10.0179 -1.4834 0.9601
hfenergy: -898.6899545 hartree
pointgroup: C01 [X(C17H21N3O1)]
dipole: -2.0530994 -1.451688 0.1056531 debye
polarizability: 289.9900632|-14.3680709|175.1918926|-23.9692437|-0.6919186|151.1121068 unknown
InChI: InChI=1S/C17H21N3O/c18-17(21)16(20-12-15-9-5-2-6-10-15)13-19-11-14-7-3-1-4-8-14/h1-10,16,19-20H,11-13,18H2
charge 0 multiplicity 1
42 atoms
O  1.431792 2.742869 0.377564
N  1.914194 -0.04467 0.046727
N  -1.852127 -0.170133 -0.022277
N  -0.871412 2.394216 0.389833
C  0.564026 0.39991 0.422071
C  -0.457564 -0.291897 -0.525393
C  3.009183 0.259291 1.003653
C  -2.884815 -0.658364 -0.981423
C  0.436353 1.958145 0.379304
C  4.348532 -0.222285 0.466174
C  -4.282234 -0.562526 -0.386062
C  5.241069 -0.958004 1.284472
C  4.73523 0.085615 -0.864726
C  -5.089108 -1.718397 -0.246392
C  -4.800804 0.689217 0.036493
C  6.500417 -1.37244 0.790816
C  5.989684 -0.330393 -1.361004
C  -6.389168 -1.629695 0.304433
C  -6.096417 0.781508 0.589082
C  6.878484 -1.060088 -0.534807
C  -6.895394 -0.379183 0.724622
H  0.296739 0.106138 1.476246
H  -0.406521 0.181003 -1.523281
H  -0.155536 -1.35932 -0.652722
H  1.920048 -1.040211 -0.214874
H  2.828306 -0.191887 2.011521
H  3.021091 1.356516 1.129679
H  -1.96124 -0.634236 0.892777
H  -2.806152 -0.026999 -1.888761
H  -2.688091 -1.707368 -1.303358
H  4.95099 -1.205351 2.313645
H  4.038482 0.650644 -1.492969
H  -4.699942 -2.691543 -0.570923
H  -4.184755 1.589798 -0.071069
H  -1.047331 3.398822 0.396556
H  -1.623229 1.676637 0.309528
H  7.181171 -1.939045 1.436752
H  6.278926 -0.082591 -2.389064
H  -7.002394 -2.532081 0.40538
H  -6.485819 1.754326 0.909563
H  7.852973 -1.381123 -0.920502
H  -7.901836 -0.307727 1.151817
