program: Gaussian 09
title: 000231652
version: EM64L-G09RevD.01
frameworkgroup: C1[X(C6H13NO)]
method: RPBEPBE
basis: SDD
operation: Freq
keyword: #p
keyword: freq=noraman
keyword: PBEPBE/SDD
title: #p freq=noraman PBEPBE/SDD
converged: YES YES NO NO
title: Mulliken charges:
elementType: O N C C C C C C H H H H H H H H H H H H H
charge: -0.190488 -0.125260 0.279684 -0.736484 -0.736866 -0.085584 -0.638551 -0.638658 0.247553 0.230403 0.211490 0.230311 0.247727 0.211580 0.152320 0.227860 0.232132 0.210429 0.231944 0.227930 0.210527
chargesum: 0.00000
title: Mulliken charges with hydrogens summed into heavy atoms:
elementType: O N C C C C C C
charge: -0.190488 -0.125260 0.279684 -0.047038 -0.047249 0.066736 0.031871 0.031743
polarizability: 8.10026052e+01 2.64622267e+00 7.03661221e+01 -5.12926616e-03 -2.27571194e-03 6.93774182e+01
1716.lowfreq: -30.6615 -15.0205 -12.9069 -0.0008 -0.0008 0.0004 59.8496 99.6979 160.1946
frequency: 59.7811 99.6887 160.1217 163.1200 185.7676 198.1479 230.6645 291.9956 311.5006 329.7025 353.1189 406.2946 446.3469 459.8034 601.6720 681.1738 817.1443 883.0512 898.7435 931.9489 993.1083 1000.3464 1040.3448 1082.3598 1130.7398 1133.8146 1177.2946 1191.6307 1238.1566 1275.7026 1362.3975 1373.0024 1389.8043 1414.9279 1442.5454 1451.4010 1461.7421 1467.7806 1476.9131 1479.3507 1488.6182 1499.1031 1502.8624 1636.7229 2803.3678 2921.8281 2931.1198 2990.8043 2993.1252 3031.8441 3032.2954 3076.9688 3082.6509 3090.0996 3094.5552 3098.2172 3101.5566
redmass: 2.5091 3.1480 1.1351 1.0490 3.8031 1.3175 1.1208 2.0043 2.8814 1.8427 3.6260 2.1515 2.0872 2.8539 3.9851 4.0803 2.2691 1.8598 2.5226 1.3659 1.9728 1.4209 1.5162 1.2443 3.6466 1.4319 2.2070 2.1554 4.0987 2.8381 1.1830 1.1874 1.2084 1.1305 1.1651 1.0504 1.0485 1.0521 1.0466 1.0639 1.0496 1.0589 1.0534 8.6983 1.0840 1.0471 1.0477 1.0344 1.0351 1.0854 1.0859 1.0995 1.0989 1.0987 1.0985 1.1009 1.1001
irintensity: 0.2423 6.0367 0.4315 1.0035 11.7869 0.0604 0.1275 1.9057 7.7519 0.5187 0.4619 1.0452 3.0087 0.3692 4.9278 26.1260 24.9827 0.9154 8.3417 0.9752 21.6911 3.5308 16.6717 4.7877 0.2837 5.4867 11.9003 18.1821 13.5291 16.1896 13.7759 21.7459 4.5878 2.8131 15.5927 0.4610 9.6570 28.9330 10.8578 6.0648 3.1731 6.6286 20.6227 116.3690 177.8202 67.8599 79.1716 21.8259 15.3485 62.6823 19.6199 10.3958 64.4395 25.9618 25.3693 21.3265 24.7266
temp: 298.150 k
press: 1.00000 atm
elementType: 8 7 6 6 6 6 6 6 1 1 1 1 1 1 1 1 1 1 1 1 1
symmnumber: 1
zpe: 475329.5 jmol-1
zpe.correction: 0.181043 hartree
zpe.thermalcorrener: 0.191574 hartree
zpe.thermalcorrenthalpy: 0.192518 hartree
zpe.thermalcorrgfe: 0.146123 hartree
zpe.sumelectzpe: -365.702614 hartree
zpe.sumelectthermal: -365.692084 hartree
zpe.sumelectthermalent: -365.691140 hartree
zpe.sumelectthermalfe: -365.737535 hartree
dipole: -1.4225 -1.8248 0.0037
dipole: 2.3138
quadrupole: -46.1512 -59.4167 -47.9977
quadrupole: -1.0026 0.0048 0.0358
quadrupole: 5.0373 -8.2282 3.1908 -1.0026 0.0048 0.0358
hfenergy: -365.883658 hartree
pointgroup: C01 [X(C6H13N1O1)]
dipole: 0.0661811 0.7452445 -0.5185361 debye
dipolederiv: -0.4301239 -0.033132 -0.0731502 -0.0050181 -0.6763838 0.3158694 -0.0938321 0.3005688 -0.5217427 -0.5677355 -0.029507 -0.0026843 -0.037602 -0.5917851 0.0316565 0.0032307 0.0356694 -0.5469861 0.4543935 0.2443006 0.0263144 0.2541131 0.1625836 0.0681226 0.0186854 0.0622945 0.0344522 -0.0077676 0.0188409 -0.0514981 -0.031639 -0.0596721 -0.0571924 -0.063157 0.0023176 0.0038007 -0.0777098 0.0171276 -0.0184917 -0.0129293 0.047545 0.038752 0.0527295 0.0232435 -0.0334497 0.584335 0.0137778 0.3126132 0.1753655 0.6521747 -0.4045347 0.1922045 -0.4915309 0.4491027 0.2754335 -0.0573042 -0.0986637 -0.090531 0.1368083 -0.0749581 -0.1215134 -0.0959964 0.3509976 0.0995522 -0.0651881 0.0656054 -0.0376258 0.4094402 0.0502963 0.0924694 0.0743378 0.2550358 0.0202675 0.0890906 -0.0772821 0.0699458 0.0338724 0.047419 -0.082962 0.0612463 0.0186858 0.0618165 0.0399286 0.0961469 0.0116134 0.0756262 0.0056454 0.0947806 -0.0303592 -0.1085173 -0.104217 -0.1448784 0.0017118 -0.0787966 0.0207188 -0.0197868 0.0172232 0.002686 0.0959733 0.090522 0.0587132 0.0264046 0.0784597 -0.0960466 -0.095638 0.0338334 -0.055138 0.0338677 0.032716 0.0598914 -0.0908711 0.0549982 0.0707025 0.0605422 -0.0672152 0.0597537 -0.030138 -0.0740912 -0.1166627 0.0111979 -0.136607 0.0048145 -0.0000617 -0.03853 -0.0476909 0.081793 -0.2896276 -0.1612565 -0.0882208 -0.1937544 -0.049837 0.0058657 -0.0630354 0.0236409 0.0464826 0.1138756 0.0434159 0.0173209 0.0899136 -0.1326991 -0.0958584 0.0464337 -0.0685964 0.0149194 0.035613 0.0670666 -0.0601361 0.0068793 0.0061873 0.1384585 0.046494 0.0812177 -0.1620335 -0.1445845 -0.0942527 -0.0251704 -0.1384699 0.050666 -0.0014499 -0.0857152 -0.0346209 0.0498653 0.034857 0.123196 -0.0390195 0.0657624 -0.15184 0.002306 -0.0583156 0.1232324 -0.0042389 0.0564103 0.0519658 0.1413499 0.0166605 0.0640159 0.0150887 0.1041197 -0.0179955 -0.124279 -0.1639352 -0.1251334 -0.073477 -0.0607386 0.0231084 -0.0305423 -0.0279281 -0.0082804 0.0964089 unknown
polarizability: 74.4040827|5.6665802|76.2502973|-1.4985932|-2.0495877|70.0917655 unknown
InChI: InChI=1S/C6H13NO/c1-6(2,5-8)7(3)4/h5H,1-4H3
charge 0 multiplicity 1
21 atoms
O  0.983616 -1.190105 1.57637
N  -1.067605 -0.190228 -0.272013
C  0.230756 0.51264 -0.093871
C  0.000505 1.97291 0.405836
C  0.999633 0.599716 -1.448534
C  1.201061 -0.146546 0.917585
C  -1.974689 -0.192626 0.901345
C  -1.002382 -1.530571 -0.903488
H  -0.714061 2.467965 -0.274556
H  -0.402933 2.012732 1.431659
H  0.948658 2.539026 0.39403
H  1.347242 -0.384399 -1.805542
H  0.325858 1.033272 -2.207807
H  1.884216 1.253076 -1.347841
H  2.177036 0.405032 1.030712
H  -2.181622 0.83676 1.237752
H  -1.591604 -0.781789 1.764154
H  -2.940266 -0.630664 0.588896
H  -0.49286 -2.297494 -0.278493
H  -0.498019 -1.478379 -1.88267
H  -2.036541 -1.872929 -1.091024
