program: Gaussian 09
title: 000231657
version: EM64L-G09RevD.01
frameworkgroup: C1[X(C7H12Cl2O2)]
method: RPBEPBE
basis: SDD
operation: Freq
keyword: #p
keyword: freq=noraman
keyword: PBEPBE/SDD
title: #p freq=noraman PBEPBE/SDD
converged: YES YES NO NO
title: Mulliken charges:
elementType: Cl Cl O O C C C C C C C H H H H H H H H H H H H
charge: -0.023244 -0.046336 -0.271350 -0.259705 -0.039178 0.023213 -0.371605 -0.343135 -0.363380 -0.572156 -0.674101 0.289622 0.220488 0.223341 0.238609 0.302217 0.212466 0.211432 0.302708 0.269329 0.205974 0.246912 0.217877
chargesum: 0.00000
title: Mulliken charges with hydrogens summed into heavy atoms:
elementType: Cl Cl O O C C C C C C C
charge: -0.023244 -0.046336 -0.271350 -0.259705 0.250443 0.243700 0.090345 -0.040917 0.060519 -0.000119 -0.003337
polarizability: 1.12443337e+02 -3.06063920e+00 9.57970909e+01 -5.27501200e+00 7.29017693e-01 8.18700984e+01
1716.lowfreq: -10.6032 -0.0037 -0.0035 -0.0034 6.3340 13.6109 29.7026 38.3730 73.9223
frequency: 29.0838 38.3613 73.8660 93.7147 102.2755 137.9880 173.9378 217.6668 231.4170 315.0803 345.3662 367.2318 411.4751 440.2684 537.4374 596.6804 654.7466 681.5373 743.9032 749.3143 835.0066 851.3155 863.4628 921.6820 927.8034 942.4388 983.3711 1019.6724 1033.4767 1073.1265 1088.8661 1108.1797 1142.7278 1154.8100 1196.8309 1203.4185 1238.4819 1241.8396 1252.5304 1271.8423 1298.3571 1307.9748 1326.6643 1355.4887 1363.2588 1392.3546 1436.5310 1454.1340 1475.2361 1480.4086 1489.9465 2986.4099 2996.9477 3000.9903 3004.7687 3047.0371 3055.4572 3059.5851 3081.4035 3093.2997 3100.2294 3114.1311 3141.7858
redmass: 5.0849 5.3640 7.8488 3.2271 2.9073 10.0027 3.3504 1.8323 1.9839 2.3955 4.4625 2.7898 4.4879 3.3989 4.9909 4.6792 5.0028 6.4575 3.2152 2.0318 2.8605 1.8074 2.4486 2.5262 2.3831 3.0038 2.5608 2.9155 2.3878 2.4658 1.8811 1.5770 2.2318 1.1584 1.3458 1.1843 1.4304 1.2843 1.3936 1.2143 1.2180 1.2906 1.2673 1.3297 1.4263 1.2056 1.0905 1.0847 1.0413 1.0876 1.0572 1.0367 1.0633 1.0661 1.0859 1.0738 1.1008 1.0709 1.0997 1.0871 1.1006 1.0987 1.1071
irintensity: 1.0105 0.5283 4.1742 2.5905 0.6755 3.0025 1.7803 0.5243 5.5116 0.7238 5.5089 2.9354 6.5540 18.1349 17.8395 22.7567 20.0253 3.5861 1.6735 4.3486 67.7228 3.7728 13.4999 10.2475 11.7252 42.3095 19.1554 55.7201 26.8173 70.6032 56.2086 11.5263 24.0116 2.3650 18.2981 8.7528 2.2118 0.4886 10.3437 2.0200 19.4278 4.7948 3.2575 11.1999 9.4239 21.6394 18.0691 7.0680 11.7282 12.0399 15.9023 31.1991 13.2742 51.8969 34.8881 0.9890 17.1218 14.5539 53.4643 7.7841 34.1493 23.0322 3.4457
temp: 298.150 k
press: 1.00000 atm
elementType: 17 17 8 8 6 6 6 6 6 6 6 1 1 1 1 1 1 1 1 1 1 1 1
symmnumber: 1
zpe: 480627.4 jmol-1
zpe.correction: 0.183061 hartree
zpe.thermalcorrener: 0.195432 hartree
zpe.thermalcorrenthalpy: 0.196376 hartree
zpe.thermalcorrgfe: 0.142101 hartree
zpe.sumelectzpe: -1343.597256 hartree
zpe.sumelectthermal: -1343.584885 hartree
zpe.sumelectthermalent: -1343.583941 hartree
zpe.sumelectthermalfe: -1343.638216 hartree
dipole: -1.0703 -1.8505 1.4528
dipole: 2.5847
quadrupole: -80.3739 -85.6787 -77.8616
quadrupole: -2.0996 5.6559 3.0071
quadrupole: 0.9308 -4.3740 3.4431 -2.0996 5.6559 3.0071
hfenergy: -1343.7803171 hartree
pointgroup: C01 [X(C7H12Cl2O2)]
dipole: 0.4516192 -0.8076567 -0.4216719 debye
dipolederiv: -0.2373912 0.1210023 -0.0344142 0.1000795 -0.5591814 0.0378556 -0.0529376 -0.0000792 -0.1531622 -0.3330979 -0.0685006 0.1050802 -0.0581068 -0.1724604 0.0411298 0.1836995 0.0957698 -0.3701198 -1.1629884 0.0769698 0.0321437 0.0203446 -0.4595657 -0.01213 0.141387 -0.0020979 -0.3646615 -0.8811426 -0.1288332 0.0838251 -0.1643088 -0.6277743 0.0168748 0.0879717 0.0265998 -0.409707 0.773053 -0.021735 0.0072952 0.257175 0.0098295 -0.0336256 0.1003319 -0.0515306 0.2050849 1.2298821 0.0561326 -0.0336503 -0.01945 0.6181021 -0.0572429 -0.0877893 -0.0056187 0.5110993 0.4175924 0.0997835 -0.0916746 -0.0821869 0.1939426 -0.0394517 -0.2178236 -0.0654403 0.3583222 0.0472805 -0.1877437 0.0369184 -0.179692 0.7365777 -0.0078669 0.0871567 0.0683762 -0.0069481 -0.1209348 -0.0428702 -0.0862947 -0.0132533 0.0267433 0.036475 -0.1348284 -0.0058672 0.0454296 0.2885048 0.123614 -0.2604597 0.1142777 0.0439477 -0.0692033 -0.3703066 -0.1492689 0.4966776 0.0048458 -0.0379049 -0.0099048 0.0192954 -0.0095675 -0.0250103 -0.037343 -0.0352701 0.0788972 -0.0061763 0.0157171 0.047257 0.0287183 0.0924238 -0.0286813 0.0389795 -0.0117904 -0.0089153 -0.0395929 -0.0193371 0.0136864 -0.0106207 0.0015279 0.0743399 0.076429 0.0626017 -0.1452084 -0.0329589 0.0577085 -0.0583314 0.0591312 0.0287805 0.0366935 0.0019061 0.0958806 -0.1462772 -0.0148851 -0.1237087 -0.0173332 -0.140914 0.0269132 -0.0157237 -0.0339358 -0.0686053 0.0547211 0.0234845 0.0037068 0.0952859 -0.0225873 -0.0349978 0.0010993 0.0259614 -0.0325757 0.0007316 -0.0421488 0.0711001 0.0450635 0.0736396 -0.0318161 -0.0784321 0.0572178 -0.100727 0.0266567 0.0504254 -0.0582475 0.058517 -0.0464952 0.0137989 0.0787686 0.0275485 0.0965524 -0.0900905 -0.0370619 0.0078521 -0.0141635 0.035813 0.1004063 0.06415 0.0011158 0.0508561 -0.0387607 0.0703774 0.0084738 0.0954318 0.0113907 -0.0850844 -0.0400385 0.1019181 -0.0098938 0.0057659 0.0886907 -0.0290428 0.0297179 -0.0418002 0.0248032 0.0621332 0.0800499 0.1101243 -0.1272964 0.0545687 0.1023458 0.0773257 0.0668914 -0.007412 -0.0587804 0.0657291 -0.0664707 0.048347 -0.1403265 -0.0264825 -0.1213214 -0.007341 0.0700631 0.016667 -0.142438 -0.0015253 0.0294139 unknown
polarizability: 112.3651101|2.6237087|95.1941118|-5.4337789|-3.4186825|82.5513043 unknown
InChI: InChI=1S/C7H12Cl2O2/c1-2-7-10-4-6(11-7)5(9)3-8/h5-7H,2-4H2,1H3
charge 0 multiplicity 1
23 atoms
Cl -2.094445 2.189002 -0.528978
Cl -3.685685 -0.721955 0.868998
O  0.657439 0.777299 0.252839
O  0.976704 -1.393936 -0.657278
C  -0.599381 0.015013 0.400835
C  1.629149 -0.077314 -0.48537
C  -0.099233 -1.448047 0.355089
C  -1.59373 0.371491 -0.724873
C  2.935993 -0.161204 0.303729
C  -2.849789 -0.486741 -0.806516
C  3.607294 1.219894 0.462088
H  -1.029829 0.286382 1.377238
H  1.780337 0.330495 -1.503658
H  0.294523 -1.741204 1.347082
H  -0.831056 -2.19355 0.012971
H  -1.085993 0.336842 -1.705381
H  3.607471 -0.859046 -0.232334
H  2.720924 -0.602731 1.295063
H  -3.609332 -0.028367 -1.454324
H  -2.612988 -1.503633 -1.158225
H  3.860317 1.657812 -0.521901
H  2.933293 1.920979 0.983294
H  4.541916 1.135419 1.044113
