program: Gaussian 09
title: 000231639
version: EM64L-G09RevD.01
frameworkgroup: C1[X(C7H9N3)]
method: RPBEPBE
basis: SDD
operation: Freq
keyword: #p
keyword: freq=noraman
keyword: PBEPBE/SDD
title: #p freq=noraman PBEPBE/SDD
converged: YES YES YES YES
title: Mulliken charges:
elementType: N N N C C C C C C C H H H H H H H H H
charge: -0.070683 -0.053326 -0.592559 -0.438164 -0.534653 -0.488232 0.290995 0.042975 -0.407700 -0.030075 0.227514 0.221173 0.228399 0.226147 0.233529 0.240541 0.248543 0.327485 0.328090
chargesum: 0.00000
title: Mulliken charges with hydrogens summed into heavy atoms:
elementType: N N N C C C C C C C
charge: -0.070683 -0.053326 0.063016 0.010523 -0.080107 -0.014162 0.290995 0.042975 -0.159156 -0.030075
polarizability: 1.31075617e+02 3.80649868e+00 9.48022572e+01 1.73119396e+00 -4.16431234e-01 5.20333772e+01
1716.lowfreq: -10.8168 -9.1765 -0.0006 -0.0005 -0.0004 9.7796 109.8917 139.0718 212.9247
frequency: 109.8879 139.0653 212.9245 294.2081 297.9840 421.2648 437.0141 455.8047 486.2137 534.1604 569.7299 599.3494 639.4974 745.2158 768.5907 789.1881 838.5049 882.6079 898.6860 913.7308 933.9079 1004.0470 1028.4093 1045.0386 1117.6034 1130.7450 1184.6994 1202.9655 1252.0195 1261.6990 1274.5851 1297.5198 1306.6651 1321.7506 1415.9048 1451.1603 1463.1487 1470.2328 1480.1295 1530.3687 1578.4165 1605.4967 2974.6376 2987.8436 3009.5089 3043.4250 3065.3776 3082.8776 3123.1560 3562.2485 3722.4398
redmass: 3.0082 2.4281 2.5992 3.4731 3.2643 2.7107 3.4299 1.3312 4.9116 1.0297 5.2796 2.5775 3.0369 3.4872 5.7451 7.5321 2.3862 1.5113 3.7093 2.4879 1.4498 2.4145 1.9991 1.7010 2.2018 1.6167 1.4846 1.2867 4.6701 1.4344 1.2989 1.9255 1.6052 2.8406 3.3108 1.1425 1.2587 2.1424 1.1393 5.2938 4.8442 1.6830 1.0651 1.0660 1.0651 1.0951 1.0952 1.1037 1.0929 1.0439 1.1059
irintensity: 3.4951 0.6911 6.5844 1.5559 7.2986 51.0512 6.8932 261.7129 7.0075 0.6814 0.2040 7.6645 0.9220 4.0195 4.8124 11.9410 4.2349 2.0100 4.2024 2.7497 8.3835 1.2558 1.6857 3.1645 1.8172 2.5671 0.7993 3.2127 18.1695 7.7176 2.1910 6.2149 4.0517 12.5858 61.9295 24.1683 17.9096 151.5981 3.1381 94.7277 70.6574 513.5591 43.1147 20.9218 34.4980 34.0547 18.4445 49.4478 23.7616 107.8168 46.9722
temp: 298.150 k
press: 1.00000 atm
elementType: 7 7 7 6 6 6 6 6 6 6 1 1 1 1 1 1 1 1 1
symmnumber: 1
zpe: 406501.0 jmol-1
zpe.correction: 0.154828 hartree
zpe.thermalcorrener: 0.163001 hartree
zpe.thermalcorrenthalpy: 0.163945 hartree
zpe.thermalcorrgfe: 0.122087 hartree
zpe.sumelectzpe: -435.680248 hartree
zpe.sumelectthermal: -435.672075 hartree
zpe.sumelectthermalent: -435.671130 hartree
zpe.sumelectthermalfe: -435.712989 hartree
dipole: 0.9887 -0.3211 0.0698
dipole: 1.0419
quadrupole: -46.8537 -58.8328 -60.1713
quadrupole: 4.5999 0.5034 0.1097
quadrupole: 8.4323 -3.5469 -4.8854 4.5999 0.5034 0.1097
hfenergy: -435.8350756 hartree
pointgroup: C01 [X(C7H9N3)]
dipole: 0.390563 0.1216552 -0.0261244 debye
dipolederiv: -1.099593 0.2680632 0.0191009 -0.2429876 -0.3558726 0.0055409 0.0242481 0.0002848 -0.2483441 -0.9018489 -0.085625 0.0170476 0.6817644 -0.548875 -0.017737 0.0118591 0.0111471 -0.2537133 -1.5006924 0.4501893 0.0113856 0.5231379 -0.2902081 -0.0221027 0.0156074 -0.0207878 -0.7315007 0.1142164 0.0341158 -0.0508367 0.0197238 0.0065422 -0.0120285 0.0268136 0.0093865 0.1496192 0.0480461 -0.0534101 -0.0094039 0.0248305 0.0556302 -0.0280477 0.0316888 -0.0243535 0.1872788 -0.1376827 -0.0581806 0.0041191 -0.1597626 -0.0338195 0.0303224 0.0547727 0.0416812 0.1112188 -0.1666439 -0.1670093 0.0008962 -0.4132983 -0.6410719 0.01837 -0.0652864 0.022082 -0.005583 0.6449956 -0.1096196 -0.0264674 0.3042029 0.5943092 -0.0157688 -0.073075 -0.0464705 0.0268909 0.6763804 0.2371311 -0.0256819 -0.057094 0.4788793 -0.0025313 -0.009556 -0.0134486 -0.0499476 1.8569682 -0.5262633 -0.0364556 -0.7113484 0.4254003 0.0179011 -0.0283094 0.011981 0.2150344 0.0745128 0.0079137 -0.0229685 0.0087277 0.0443161 -0.0075668 -0.0982861 -0.0208533 -0.1613148 -0.178621 -0.0482339 0.0734899 -0.0523717 0.0594345 0.0170125 0.1149317 0.0217568 0.0448171 -0.0120138 0.0460005 -0.0358005 0.0748909 -0.0704059 0.0907542 -0.094678 0.1166418 0.0126741 -0.0542973 0.0353593 0.0542563 0.0082903 0.0499968 -0.0577127 0.1027742 -0.1015209 -0.1155349 0.0160083 -0.0330415 0.0175779 0.0012312 0.0497916 0.0633377 0.0205341 0.105626 -0.0977075 0.0480117 0.0137644 0.0001644 0.0006282 -0.0639213 -0.0887727 -0.0393531 -0.1244607 0.0304275 0.0798886 0.0396964 -0.0000906 0.0459029 -0.1111429 0.0008332 -0.0034644 0.0032611 0.1062304 0.2191718 -0.0426522 0.0061226 -0.0794956 0.1975727 0.0049909 0.0057894 0.0043427 0.3893516 0.2731933 -0.0081982 0.0035444 0.0230274 0.1534442 0.0032052 0.0029894 0.0037044 0.3901032 unknown
polarizability: 130.9889753|-4.2396571|94.8996571|-1.4881425|-0.3804097|52.0226188 unknown
InChI: InChI=1S/C7H9N3/c8-7-9-4-5-2-1-3-6(5)10-7/h4H,1-3,8H2
charge 0 multiplicity 1
19 atoms
N  -0.835143 1.151801 -0.032134
N  -1.698459 -1.156477 0.029351
N  -3.137485 0.696823 0.041034
C  2.792417 0.392651 0.27055
C  2.192736 -1.009019 -0.098279
C  1.698796 1.438418 -0.115347
C  0.69587 -0.763257 -0.038653
C  0.415704 0.631196 -0.051385
C  -0.414046 -1.627679 -0.002654
C  -1.849559 0.211755 0.011072
H  2.971096 0.436109 1.360642
H  3.755457 0.581684 -0.233718
H  2.534534 -1.802548 0.590475
H  2.500616 -1.31261 -1.119344
H  1.844879 1.818827 -1.14616
H  1.673261 2.316662 0.552021
H  -0.309593 -2.719163 0.007568
H  -3.287181 1.7017 0.029923
H  -3.912102 0.040332 0.074637
