program: Gaussian 09
title: 000231691
version: EM64L-G09RevD.01
frameworkgroup: C1[X(C20H34N2O2)]
method: RPBEPBE
basis: SDD
operation: Freq
keyword: #p
keyword: freq=noraman
keyword: PBEPBE/SDD
title: #p freq=noraman PBEPBE/SDD
converged: YES YES NO NO
title: Mulliken charges:
elementType: O O N N C C C C C C C C C C C C C C C C C C C C H H H H H H H H H H H H H H H H H H H H H H H H H H H H H H H H H H
charge: -0.416426 -0.230643 -0.104249 -0.106157 0.188871 -0.482759 -0.491069 -0.398732 -0.420743 0.418217 0.082678 -0.404482 -0.386172 -0.326640 -0.327009 -0.338163 -0.327301 -0.248079 -0.255793 -0.676495 -0.678401 -0.677466 -0.677077 -0.243408 0.240693 0.228314 0.234494 0.227934 0.212882 0.220571 0.211087 0.217957 0.255679 0.255867 0.186533 0.203436 0.187706 0.214705 0.186244 0.228052 0.188357 0.203163 0.225113 0.226646 0.377129 0.206307 0.206308 0.229536 0.229972 0.205771 0.204838 0.226098 0.206509 0.205652 0.227864 0.208974 0.207949 0.229156
chargesum: 0.00000
title: Mulliken charges with hydrogens summed into heavy atoms:
elementType: O O N N C C C C C C C C C C C C C C C C C C C C
charge: -0.039297 -0.230643 -0.104249 -0.106157 0.188871 -0.013752 -0.028641 0.034721 0.008302 0.418217 0.082678 -0.148802 -0.130305 0.063329 0.075401 0.076133 0.064218 -0.022966 -0.029147 -0.034344 -0.037820 -0.039206 -0.032290 -0.014252
polarizability: 2.64748833e+02 1.84490766e+01 2.42374549e+02 -5.77379801e+00 1.09051728e+01 2.11228410e+02
1716.lowfreq: -10.8275 -8.3670 -0.0009 -0.0008 -0.0006 3.4077 15.5669 20.0812 27.2688
frequency: 15.0392 19.4629 27.1119 36.7553 40.6686 48.2641 57.7250 61.3009 72.3892 76.3403 84.3232 86.1450 110.2514 115.3661 124.8326 162.7521 180.5666 186.6213 196.9310 213.6038 226.6308 237.5917 262.2584 271.2866 284.3163 294.0476 315.5764 319.0615 324.6932 345.0735 359.2365 404.4470 405.2849 419.6833 434.3409 445.6145 471.6894 474.3511 490.3341 527.8003 578.3470 597.1283 616.1855 616.4781 697.1259 705.3282 717.3204 738.2821 743.6660 764.9348 778.0745 790.2499 794.9913 795.6610 797.0005 827.8867 854.6839 863.4362 905.1627 915.1473 924.1170 947.4852 979.6111 984.4932 988.5423 990.0714 995.7204 1012.5872 1028.8080 1042.5186 1054.4719 1061.4811 1073.2717 1074.6308 1078.5183 1081.3972 1083.9863 1084.0424 1084.4247 1090.4193 1102.4960 1126.3233 1137.0869 1155.7625 1173.9357 1187.4843 1196.3634 1202.6552 1204.2784 1205.2571 1245.5061 1254.9066 1274.9527 1280.4467 1284.1250 1288.7354 1289.7157 1297.7433 1306.2624 1317.6951 1320.9790 1328.7488 1359.5791 1364.6027 1368.1610 1369.6748 1376.5985 1382.7714 1384.9180 1385.8706 1386.3592 1386.5637 1387.4706 1433.6432 1459.3157 1460.0650 1461.2402 1462.4962 1469.6989 1470.5277 1471.7750 1475.1494 1477.9777 1480.5213 1481.0403 1485.3070 1485.4516 1488.4855 1489.2548 1491.6015 1494.0632 1589.0634 1608.7454 1636.2441 2848.5810 2849.2483 2850.9404 2857.4949 2865.2356 2879.2943 2978.3749 2980.9049 2981.9166 2982.1017 3016.0938 3021.7599 3025.2509 3028.5631 3030.0917 3030.8687 3033.3458 3035.8125 3068.1831 3071.7386 3073.4449 3074.3587 3075.2711 3078.5313 3089.9473 3090.6100 3090.7621 3091.2994 3119.4951 3127.6761 3140.2852 3155.8577 3167.8630 3511.2782
redmass: 3.3244 3.2383 3.8679 4.2002 3.8782 3.4805 4.4219 3.8747 2.9391 2.9932 2.0030 2.4376 2.7635 2.7266 4.1365 1.6252 1.7730 1.7797 1.6636 1.5817 1.6784 2.1408 2.3807 2.3657 1.8464 2.0638 2.6793 2.8496 2.6246 3.3608 3.0906 2.8519 3.2765 3.2106 2.9968 2.8268 2.6627 2.7305 3.1419 2.5624 3.7084 3.1863 1.6538 5.2926 4.6207 1.9154 2.9877 2.2171 2.0024 1.4505 2.0089 1.1837 1.1386 1.1361 1.2266 1.6593 1.2850 2.3744 2.2201 1.9211 1.5917 2.5427 1.4007 2.1321 2.3945 4.9606 1.3498 2.3735 2.3700 2.4020 2.5223 2.3299 1.8805 1.9974 2.4037 2.6877 2.2618 2.1459 2.3795 1.9658 1.9461 1.9507 1.8139 2.3236 1.0557 2.5764 2.1244 1.4875 2.0624 1.9718 1.4047 1.5142 1.3706 1.1601 1.2837 1.2993 1.2904 1.2634 1.1477 1.4055 1.3968 1.3768 1.3385 1.3299 1.3329 1.3299 3.5745 1.5482 1.2485 1.2646 1.2495 1.2584 1.3365 2.2450 1.0652 1.0538 1.0537 1.0528 1.0693 1.0589 1.0767 1.0914 1.0504 1.1799 1.0633 1.5198 1.0801 1.0855 1.0757 1.0784 1.1117 5.8664 5.8909 8.9127 1.0721 1.0717 1.0722 1.0716 1.0710 1.0702 1.0362 1.0357 1.0357 1.0358 1.0606 1.0613 1.0854 1.0878 1.0879 1.0858 1.0883 1.0872 1.0981 1.0984 1.0983 1.0979 1.1007 1.1013 1.1002 1.1002 1.1002 1.1001 1.0855 1.0876 1.0933 1.0960 1.0987 1.0639
irintensity: 0.1507 0.1231 0.0863 0.2146 0.0488 0.0568 0.3855 0.5167 0.2021 0.0567 0.1921 0.2234 0.3931 0.8154 0.1556 0.0801 1.0904 1.3276 0.3167 0.3070 0.7320 0.9888 0.4893 0.6181 1.8875 0.4044 0.2484 0.1316 0.9933 4.5132 0.3536 0.3955 8.4986 4.2563 1.4040 2.5352 2.1555 6.9398 3.1185 17.0998 26.8058 54.6838 94.5488 7.1942 19.0153 50.0425 22.3610 36.3128 2.9258 3.4429 24.0299 17.3929 7.4252 1.7058 6.6855 0.6426 0.4348 4.0007 1.9885 7.8525 0.1441 9.9742 0.5642 10.4767 1.4598 0.3195 0.1060 118.0890 17.9550 2.0468 9.3438 47.5001 9.0504 16.7528 16.2731 113.6261 2.7847 2.8196 5.5882 57.8849 13.2982 4.8922 13.4068 8.9308 0.0995 4.1079 21.4059 26.4798 26.3260 7.6422 3.2514 8.6259 4.3236 4.6269 31.3282 8.8570 41.0689 12.2410 0.9473 14.0593 3.8406 2.2505 2.4235 5.7194 4.6166 3.8535 0.3694 7.4352 12.5671 7.4174 25.8370 27.9660 7.1249 9.7111 0.0892 9.2401 7.3705 6.3766 1.5297 3.5170 5.3558 4.7662 2.5581 20.1196 13.4763 13.6124 14.9759 3.5894 4.3786 9.7000 7.4781 2.5076 20.6918 188.3368 29.3234 67.5351 28.7450 116.7675 197.1803 110.1814 29.3014 32.2669 50.2109 20.2947 17.5071 11.0198 4.8693 21.4210 27.1150 0.8451 20.6003 19.0410 80.5334 40.8826 44.9415 101.0010 55.9660 23.2779 37.5296 14.4060 48.1914 51.2940 2.2873 1.4697 20.8086 35.2130 13.9740 26.3577
temp: 298.150 k
press: 1.00000 atm
elementType: 8 8 7 7 6 6 6 6 6 6 6 6 6 6 6 6 6 6 6 6 6 6 6 6 1 1 1 1 1 1 1 1 1 1 1 1 1 1 1 1 1 1 1 1 1 1 1 1 1 1 1 1 1 1 1 1 1 1
symmnumber: 1
zpe: 1327948.4 jmol-1
zpe.correction: 0.505789 hartree
zpe.thermalcorrener: 0.533849 hartree
zpe.thermalcorrenthalpy: 0.534793 hartree
zpe.thermalcorrgfe: 0.443957 hartree
zpe.sumelectzpe: -1040.543987 hartree
zpe.sumelectthermal: -1040.515927 hartree
zpe.sumelectthermalent: -1040.514982 hartree
zpe.sumelectthermalfe: -1040.605818 hartree
dipole: 0.6420 -0.2817 -1.3654
dipole: 1.5349
quadrupole: -138.5799 -142.6811 -151.9788
quadrupole: 1.6805 7.0246 -1.5814
quadrupole: 5.8334 1.7321 -7.5655 1.6805 7.0246 -1.5814
hfenergy: -1041.0497754 hartree
pointgroup: C01 [X(C20H34N2O2)]
dipole: 0.1972383 -0.1566612 -0.5488437 debye
polarizability: 264.7119979|17.7567474|242.0628357|-11.4885869|7.5437626|211.5769584 unknown
InChI: InChI=1S/C20H34N2O2/c1-5-21(6-2)16-14-20(19(23)24,15-17-22(7-3)8-4)18-12-10-9-11-13-18/h9-13,23H,5-8,14-17H2,1-4H3
charge 0 multiplicity 1
58 atoms
O  1.399843 -2.368295 1.717558
O  -0.069251 -1.15395 3.024314
N  -2.117305 2.515141 0.038215
N  3.521272 0.450527 -0.495532
C  -0.031646 -0.749766 0.558473
C  -0.770277 0.588809 0.89535
C  1.214574 -0.506894 -0.343428
C  -1.260035 1.361742 -0.347401
C  2.244208 0.473474 0.262266
C  -1.033503 -1.762944 -0.071728
C  0.404952 -1.391567 1.890353
C  -0.870256 -2.289862 -1.376755
C  -2.168946 -2.169009 0.680973
C  -2.02118 3.653488 -0.914027
C  -3.524572 2.108199 0.307654
C  4.39052 -0.693874 -0.101663
C  4.237943 1.754245 -0.472876
C  -1.818719 -3.187359 -1.919208
C  -3.115109 -3.066092 0.14237
C  -0.713603 4.454075 -0.759662
C  -4.251294 3.060695 1.276198
C  5.349423 -1.134701 -1.223971
C  3.595482 2.80736 -1.395796
C  -2.94651 -3.578993 -1.164759
H  -0.107294 1.24601 1.486279
H  -1.626705 0.366824 1.555296
H  1.712291 -1.472251 -0.53811
H  0.894719 -0.107261 -1.322562
H  -0.389052 1.754573 -0.902812
H  -1.794058 0.669157 -1.043597
H  2.409894 0.235306 1.344067
H  1.839596 1.500848 0.229914
H  -0.003815 -2.009054 -1.981866
H  -2.307448 -1.79238 1.701707
H  -2.133846 3.311901 -1.9751
H  -2.870167 4.332378 -0.714038
H  -4.108346 2.014139 -0.64358
H  -3.505101 1.097415 0.755609
H  4.974404 -0.454538 0.823737
H  3.733501 -1.54326 0.160463
H  4.317406 2.15956 0.568179
H  5.272778 1.57385 -0.816661
H  -1.673185 -3.580145 -2.932035
H  -3.980376 -3.367599 0.743604
H  1.583714 -2.791146 2.600005
H  -0.692743 5.305632 -1.465526
H  0.17742 3.831546 -0.963661
H  -0.627848 4.842013 0.270221
H  -3.711352 3.107406 2.237722
H  -4.31703 4.088104 0.874013
H  -5.283165 2.708662 1.463865
H  4.775177 -1.430634 -2.119128
H  6.042329 -0.325372 -1.518105
H  5.96164 -1.995142 -0.894215
H  3.557637 2.428892 -2.432079
H  2.56339 3.054757 -1.085477
H  4.180411 3.746039 -1.37946
H  -3.67999 -4.275679 -1.585689
