program: Gaussian 09
title: 000231693
version: EM64L-G09RevD.01
frameworkgroup: C1[X(C22H20O3)]
method: RPBEPBE
basis: SDD
operation: Freq
keyword: #pfreq=noraman
keyword: PBEPBE/SDD
title: #p freq=noraman PBEPBE/SDD
converged: YES YES NO NO
title: Mulliken charges:
elementType: O O O C C C C C C C C C C C C C C C C C C C C C C H H H H H H H H H H H H H H H H H H H H
charge: -0.305050 -0.267743 -0.264070 -0.288571 -0.309379 0.222941 0.216611 0.477482 0.552554 -0.384065 -0.403121 -0.236451 -0.230068 -0.418709 -0.442043 -0.382893 -0.377021 -0.361471 -0.359902 -0.356423 -0.367682 0.317486 0.316311 -0.538304 -0.537917 0.230614 0.219429 0.247132 0.251693 0.226990 0.227163 0.231286 0.234627 0.266123 0.243465 0.248377 0.250354 0.237272 0.240206 0.221576 0.243796 0.219341 0.220815 0.245646 0.221595
chargesum: 0.00000
title: Mulliken charges with hydrogens summed into heavy atoms:
elementType: O O O C C C C C C C C C C C C C C C C C C C C C C
charge: -0.305050 -0.267743 -0.264070 -0.057957 -0.089950 0.222941 0.216611 0.477482 0.552554 -0.136933 -0.151428 -0.009461 -0.002905 -0.187423 -0.207416 -0.116770 -0.133556 -0.113094 -0.109548 -0.119151 -0.127476 0.317486 0.316311 0.146409 0.150139
polarizability: 3.10587940e+02 -1.28600442e+01 2.50345180e+02 -8.15256564e+00 -9.94027048e+00 1.83062618e+02
1716.lowfreq: -10.2550 -4.7410 -0.0004 0.0001 0.0003 0.4386 9.5606 22.4667 28.2592
frequency: 8.8990 22.3799 28.2223 42.0494 46.2995 70.7429 91.6566 101.8593 135.4930 152.2052 156.9965 176.3894 206.2792 224.8990 230.1346 242.3716 257.8933 276.8636 302.3072 335.6665 362.7275 414.0402 415.2973 421.9910 444.3626 457.8497 470.1022 489.2535 508.1678 528.2226 546.0956 558.8382 568.3499 620.8113 626.7120 638.4014 683.2222 702.3099 716.5584 734.3450 740.9713 763.4402 765.5562 804.5933 815.6231 822.0773 826.2422 829.4676 845.5232 869.6766 875.4360 887.2629 889.2509 941.9391 949.4279 953.4312 955.3185 964.4527 967.4566 988.1305 988.4147 989.4620 1003.1060 1003.6529 1023.4127 1091.8258 1110.3352 1111.1253 1111.9266 1112.2762 1155.3838 1155.9531 1163.8211 1169.7975 1173.3853 1178.5097 1198.8890 1204.3643 1215.2808 1220.0644 1228.3819 1232.0851 1243.7394 1277.0093 1281.8335 1296.5535 1311.8296 1319.9271 1383.7960 1390.8644 1393.0227 1415.7667 1420.9676 1435.7296 1436.4897 1443.4097 1465.6207 1466.9301 1468.1949 1471.9954 1472.8067 1501.1513 1503.6194 1585.0701 1585.9790 1598.9303 1616.2300 1622.5293 1624.2386 2920.3634 2938.9873 2957.1801 2959.4518 3044.1291 3046.9265 3115.8421 3122.7848 3124.7347 3125.1673 3125.3756 3130.0184 3133.6873 3145.5615 3145.6204 3160.0010 3162.3826 3164.0013 3167.2923 3167.8207
redmass: 5.6461 3.7411 3.3981 4.8245 4.8613 4.2918 3.5998 3.7803 4.2699 4.5285 3.9649 4.2498 3.2644 1.9994 1.4671 1.9802 3.1939 3.7885 4.8655 5.2274 5.4223 2.9636 2.9673 3.2169 4.3529 4.2186 4.0934 3.8545 4.3037 4.1164 5.2211 4.5394 2.9249 5.7898 6.8072 6.1995 5.8647 4.6934 3.5631 3.1541 2.5325 2.4647 4.9820 2.3599 1.4636 1.3280 2.1359 1.9166 2.2913 3.2018 3.1070 2.1711 3.3723 5.1676 1.3899 1.5185 1.4770 1.3594 1.3545 1.5472 4.3311 8.6836 2.6380 2.5923 2.1721 2.2990 1.3405 1.2745 1.3424 1.2603 1.3468 1.3555 1.7977 1.0960 1.3086 1.2575 2.3282 1.4692 1.3592 1.5995 2.9201 3.1809 1.4591 1.7140 1.5625 1.8283 1.4266 1.7474 4.6693 4.9891 5.5927 3.5188 3.0076 1.1744 1.1780 2.3860 1.0504 1.0500 2.6982 1.0814 1.0773 2.4848 2.5343 7.0222 7.1011 7.3624 7.0324 6.3579 6.4908 1.0827 1.0833 1.0330 1.0330 1.1038 1.1039 1.0894 1.0991 1.0853 1.0978 1.0905 1.0892 1.0895 1.0878 1.0945 1.0945 1.1004 1.0948 1.0957 1.0952
irintensity: 0.0312 1.3514 0.9295 0.3635 1.2086 1.0729 5.1065 1.3389 2.0531 4.6716 1.7498 5.2445 2.6499 1.2747 0.5118 2.1573 1.7617 0.4663 0.3814 0.4076 2.2472 0.1448 0.6521 2.4229 0.8760 0.7310 0.0834 7.1055 10.5499 26.2439 29.3352 13.8322 9.4028 3.0627 5.3302 3.4805 9.3044 5.7805 7.5957 11.3122 36.0533 36.0060 4.3484 32.8936 37.4843 0.3575 43.3418 48.7820 25.7929 1.3303 14.5676 5.2831 5.3233 141.8022 1.2141 17.9486 8.5782 0.4789 0.1890 6.5456 24.2873 44.4016 1.1228 10.6281 8.0894 0.4733 7.1546 2.2497 11.2489 0.1979 0.2364 0.2600 28.6004 5.6024 47.0987 81.9789 3.1798 1.9499 5.3836 32.8451 142.9062 177.8805 15.0624 10.6790 25.8389 37.2951 8.3872 18.1792 7.3919 5.6573 6.7000 0.8909 2.6122 12.7966 9.4191 15.9401 13.1605 13.1258 10.5767 48.1154 60.2813 111.6631 96.4101 17.8030 8.7118 1.3683 4.0793 83.1701 55.4199 44.4754 53.2570 59.7045 65.7335 48.7970 47.9604 16.1837 30.2875 1.7629 28.9284 15.6865 8.2270 5.1924 5.3883 27.1246 11.2978 30.5606 13.5174 5.6439 6.2845
temp: 298.150 k
press: 1.00000 atm
elementType: 8 8 8 6 6 6 6 6 6 6 6 6 6 6 6 6 6 6 6 6 6 6 6 6 6 1 1 1 1 1 1 1 1 1 1 1 1 1 1 1 1 1 1 1 1
symmnumber: 1
zpe: 940298.1 jmol-1
zpe.correction: 0.358141 hartree
zpe.thermalcorrener: 0.380004 hartree
zpe.thermalcorrenthalpy: 0.380948 hartree
zpe.thermalcorrgfe: 0.303969 hartree
zpe.sumelectzpe: -1074.212050 hartree
zpe.sumelectthermal: -1074.190187 hartree
zpe.sumelectthermalent: -1074.189242 hartree
zpe.sumelectthermalfe: -1074.266221 hartree
dipole: 0.7599 -0.9790 3.3167
dipole: 3.5407
quadrupole: -143.4022 -124.0426 -141.8919
quadrupole: -0.9679 3.4400 -10.5441
quadrupole: -6.9566 12.4029 -5.4463 -0.9679 3.4400 -10.5441
hfenergy: -1074.5701904 hartree
pointgroup: C01 [X(C22H20O3)]
dipole: -0.282192 0.3184257 1.3264451 debye
polarizability: 310.064545|-14.567887|249.6579222|6.8103875|13.5620789|184.2732717 unknown
InChI: InChI=1S/C22H20O3/c1-23-17-11-7-15(8-12-17)21-19-5-3-4-6-20(19)22(25-21)16-9-13-18(24-2)14-10-16/h3-14,21-22H,1-2H3
charge 0 multiplicity 1
45 atoms
O  -0.017981 -0.482218 -1.65339
O  5.380636 2.348977 0.542085
O  -5.248313 2.596454 0.418225
C  1.208653 -1.211975 -1.223945
C  -1.245128 -1.220008 -1.183368
C  0.70621 -2.171355 -0.14604
C  -0.705054 -2.177923 -0.131456
C  2.277723 -0.225376 -0.777995
C  -2.290387 -0.223764 -0.719573
C  1.441869 -2.985728 0.735767
C  -1.412626 -3.006066 0.761501
C  0.736971 -3.821566 1.635416
C  -0.680031 -3.832902 1.64701
C  3.649987 -0.554859 -0.926112
C  -3.412638 0.070326 -1.535218
C  1.937453 1.010829 -0.185335
C  -2.159033 0.454697 0.515665
C  4.657926 0.315998 -0.473279
C  -4.378793 1.010177 -1.133283
C  2.935962 1.901693 0.267188
C  -3.116367 1.400996 0.937858
C  4.301809 1.548246 0.129342
C  -4.232255 1.679671 0.106945
C  5.065341 3.640039 1.156045
C  -5.142069 3.322064 1.686103
H  1.595053 -1.794317 -2.090172
H  -1.648573 -1.784459 -2.05235
H  2.537319 -2.962019 0.737509
H  -2.508191 -3.000325 0.77959
H  1.290547 -4.460183 2.332894
H  -1.211865 -4.482214 2.351488
H  3.935558 -1.497119 -1.411147
H  -3.525773 -0.438652 -2.500381
H  0.880406 1.28522 -0.11204
H  -1.300324 0.233886 1.16057
H  5.718916 0.072772 -0.58463
H  -5.246954 1.244243 -1.756521
H  2.642053 2.85782 0.71118
H  -2.989245 1.906686 1.899664
H  4.518891 4.298797 0.452952
H  6.039797 4.087581 1.401239
H  4.470021 3.512413 2.081418
H  -5.157606 2.629161 2.550031
H  -6.027214 3.97411 1.718314
H  -4.222879 3.938869 1.722136
