program: Gaussian 09
title: 000231621
version: EM64L-G09RevD.01
frameworkgroup: C1[X(C16H18O4)]
method: RPBEPBE
basis: SDD
operation: Freq
keyword: #pfreq=noraman
keyword: PBEPBE/SDD
title: #p freq=noraman PBEPBE/SDD
converged: YES YES NO NO
title: Mulliken charges:
elementType: O O O O C C C C C C C C C C C C C C C C H H H H H H H H H H H H H H H H H H
charge: -0.296437 -0.273266 -0.419941 -0.240460 0.446347 -0.570350 0.110385 -0.391025 0.212590 -0.473136 0.183282 0.146993 -0.502179 -0.403863 -0.416074 -0.394982 -0.243125 0.195794 -0.538679 -0.532360 0.230238 0.240240 0.238495 0.227679 0.241953 0.246606 0.256454 0.239170 0.276639 0.233971 0.224546 0.226106 0.238122 0.222741 0.241932 0.221638 0.221553 0.372401
chargesum: 0.00000
title: Mulliken charges with hydrogens summed into heavy atoms:
elementType: O O O O C C C C C C C C C C C C C C C C
charge: -0.296437 -0.273266 -0.047540 -0.240460 0.446347 -0.099872 0.110385 0.075150 0.212590 -0.231183 0.183282 0.146993 0.000881 -0.164693 -0.139435 -0.161011 -0.018579 0.195794 0.148290 0.152763
polarizability: 2.47173931e+02 1.23260535e+01 2.34902188e+02 -1.38057592e+01 8.14580861e+00 1.01454615e+02
1716.lowfreq: -0.0009 -0.0002 0.0004 1.2334 4.6504 8.2493 22.7140 27.0127 33.7418
frequency: 22.6364 26.9546 33.7186 59.0205 61.7007 94.7038 100.7621 120.1186 154.3383 176.4798 188.0031 220.0359 242.5998 247.1773 258.6818 272.2508 294.0079 313.3589 336.2085 373.3311 396.5903 441.5679 471.9150 477.3501 496.5739 512.5154 521.3115 531.2530 583.9663 606.5108 632.5654 643.0626 654.0821 675.4101 729.1311 749.4158 767.9423 775.7042 820.7111 824.0930 827.5005 831.5726 860.7343 881.3883 933.8027 954.9672 976.1156 992.6566 1022.4774 1030.2856 1031.6131 1059.2591 1087.8030 1101.7641 1111.0608 1113.3646 1142.2606 1147.7575 1156.4080 1168.4651 1186.3418 1194.6840 1212.8152 1227.3824 1242.3974 1252.1224 1261.3480 1287.6106 1304.5362 1350.2764 1362.2787 1366.7885 1384.1410 1397.1416 1417.1457 1433.1370 1433.8968 1440.7706 1457.4182 1459.5062 1466.0150 1466.6588 1474.7812 1477.8535 1481.1087 1525.9291 1592.2468 1595.4052 1619.8113 1667.7118 2958.7414 2959.1726 2987.9050 3002.6376 3010.6172 3043.3424 3046.3885 3047.7546 3062.1189 3087.8085 3117.3019 3122.8286 3127.3601 3137.9511 3165.6429 3168.6341 3185.1275 3509.1658
redmass: 5.7047 5.5546 8.0789 3.6138 3.2711 5.3668 3.6230 4.3605 3.4942 3.6597 2.9144 2.7190 2.2139 1.3000 1.7081 3.5147 2.0395 4.4033 3.4631 3.3805 3.9498 5.2986 3.7542 4.2359 2.0221 4.1658 6.2498 4.4185 3.7165 3.8834 3.6506 1.3942 4.0857 4.5502 2.8739 1.7664 2.3970 2.7777 2.3860 2.1880 2.1837 4.7734 2.0842 1.4594 1.3983 6.1126 1.3159 2.5986 3.6084 2.6608 8.0138 2.6354 1.9855 1.9241 1.2612 1.2610 2.4292 1.5292 1.3889 1.2817 1.4572 1.4540 1.2720 2.2649 2.8450 1.6407 1.8914 1.2334 1.3421 1.5115 1.7402 3.7945 2.3745 3.9749 2.6449 1.1490 1.1573 1.2969 1.2637 1.7004 1.0509 1.0526 1.0670 1.0996 1.1111 4.4506 5.7084 7.5941 7.0327 7.9452 1.0325 1.0326 1.0615 1.0611 1.0647 1.0956 1.1038 1.1039 1.0978 1.1018 1.0998 1.0992 1.0897 1.0875 1.0936 1.0917 1.0963 1.0639
irintensity: 0.3108 0.0393 1.6767 2.9282 0.9478 2.2965 0.4805 12.0063 0.2277 4.6342 0.2452 0.6380 1.3559 0.4887 0.4077 1.8071 0.4830 0.7413 0.3975 1.8620 1.7277 31.5172 5.5483 4.6586 26.8146 6.2086 1.1145 4.6471 9.3831 17.1063 4.1565 125.1333 2.7991 0.0153 13.7133 13.8900 40.8875 32.1067 49.5285 2.0588 14.9150 18.2983 2.8261 0.3745 0.1648 4.8272 1.8530 6.8595 86.0954 209.8852 237.1905 6.1921 33.5268 47.6519 0.1970 0.1556 4.9540 2.5479 3.3920 8.7406 40.8141 1.0076 5.2046 13.2353 219.8307 6.2517 26.3962 9.9838 6.6208 3.3823 57.8594 8.9900 51.3112 36.2590 51.4046 17.8661 14.1718 17.8292 10.5095 3.7453 12.2149 11.1761 73.9194 5.4281 18.2948 104.3733 61.8067 8.7413 2.4235 170.7839 154.2440 1.4377 19.5757 6.1775 38.5205 14.6926 45.9648 45.4408 7.7356 17.2757 22.2799 29.2558 10.4075 13.9983 17.8009 14.3441 10.8187 19.5394
temp: 298.150 k
press: 1.00000 atm
elementType: 8 8 8 8 6 6 6 6 6 6 6 6 6 6 6 6 6 6 6 6 1 1 1 1 1 1 1 1 1 1 1 1 1 1 1 1 1 1
symmnumber: 1
zpe: 802208.4 jmol-1
zpe.correction: 0.305545 hartree
zpe.thermalcorrener: 0.324923 hartree
zpe.thermalcorrenthalpy: 0.325867 hartree
zpe.thermalcorrgfe: 0.255906 hartree
zpe.sumelectzpe: -919.914285 hartree
zpe.sumelectthermal: -919.894907 hartree
zpe.sumelectthermalent: -919.893963 hartree
zpe.sumelectthermalfe: -919.963924 hartree
dipole: 0.2562 1.4243 0.1504
dipole: 1.4550
quadrupole: -104.4889 -96.2899 -120.6632
quadrupole: 11.0677 -1.7342 1.3912
quadrupole: 2.6584 10.8574 -13.5159 11.0677 -1.7342 1.3912
hfenergy: -920.2198302 hartree
pointgroup: C01 [X(C16H18O4)]
dipole: -0.1052538 0.5623556 0.0190257 debye
polarizability: 246.4200925|-9.9966981|234.4973688|-19.3103778|9.9445371|102.6132727 unknown
InChI: InChI=1S/C16H18O4/c1-19-13-10-9-11(5-3-8-15(17)18)16-12(13)6-4-7-14(16)20-2/h4,6-7,9-10,17H,3,5,8H2,1-2H3
charge 0 multiplicity 1
38 atoms
O  -0.71503 2.246028 0.588663
O  3.980355 -1.539105 -0.51814
O  -5.941795 -0.843973 0.191099
O  -4.191002 -2.290559 -0.278607
C  -0.114814 -0.600726 0.289935
C  -1.606904 -0.387336 0.52858
C  0.881085 0.451346 0.174738
C  -2.370451 -0.03494 -0.777439
C  2.265424 0.091613 -0.099175
C  0.307562 -1.928972 0.13193
C  0.617651 1.873735 0.322165
C  2.620207 -1.299173 -0.254217
C  -3.881949 0.163148 -0.551632
C  1.653862 -2.299565 -0.139544
C  3.287841 1.088141 -0.214214
C  1.634543 2.83252 0.205198
C  2.974813 2.43562 -0.064064
C  -4.62132 -1.118169 -0.212807
C  -1.00963 3.667199 0.774912
C  4.396034 -2.93198 -0.682643
H  -1.782625 0.411115 1.266973
H  -2.028776 -1.326744 0.931407
H  -1.951647 0.897653 -1.196027
H  -2.209249 -0.838844 -1.520084
H  -0.443648 -2.722842 0.218099
H  -4.076051 0.894909 0.255575
H  -4.364365 0.5799 -1.458704
H  1.905881 -3.357792 -0.250311
H  4.309253 0.761086 -0.419693
H  1.411255 3.896597 0.319071
H  3.753659 3.200807 -0.150934
H  -0.446497 4.08746 1.630664
H  -2.089094 3.708969 0.985098
H  -0.785141 4.25099 -0.13907
H  5.477065 -2.888688 -0.881523
H  3.876764 -3.40825 -1.537151
H  4.207901 -3.518751 0.237668
H  -6.405562 -1.704126 0.383905
