program: Gaussian 09
title: 000231624
version: EM64L-G09RevD.01
frameworkgroup: C1[X(C19H13Br)]
method: RPBEPBE
basis: SDD
operation: Freq
keyword: #p
keyword: freq=noraman
keyword: PBEPBE/SDD
title: #p freq=noraman PBEPBE/SDD
converged: YES YES NO NO
title: Mulliken charges:
elementType: Br C C C C C C C C C C C C C C C C C C C H H H H H H H H H H H H H
charge: -0.031984 -0.677275 0.364557 0.292418 0.166397 0.184350 0.551863 -0.359687 -0.377284 -0.400549 -0.401393 -0.394318 -0.365717 -0.251276 -0.245872 -0.228773 -0.229885 -0.235922 -0.244237 -0.239850 0.251604 0.267544 0.243632 0.243187 0.255984 0.252781 0.229743 0.231592 0.229135 0.229136 0.229026 0.229883 0.231187
chargesum: 0.00000
title: Mulliken charges with hydrogens summed into heavy atoms:
elementType: Br C C C C C C C C C C C C C C C C C C C
charge: -0.031984 -0.677275 0.364557 0.292418 0.166397 0.184350 0.551863 -0.108083 -0.109740 -0.156916 -0.158206 -0.138334 -0.112935 -0.021533 -0.014279 0.000362 -0.000749 -0.006896 -0.014354 -0.008663
polarizability: 2.54621232e+02 -1.04537221e+01 2.51503379e+02 -1.49080871e+01 5.19453355e+00 1.68633408e+02
1716.lowfreq: -5.8180 0.0004 0.0005 0.0006 5.8330 8.2679 43.6549 50.9253 59.7394
frequency: 43.6400 50.9177 59.7372 91.6568 101.2913 121.8428 153.8964 186.9669 225.7336 233.8408 265.6077 297.4122 308.1435 403.3876 412.6184 421.1569 459.5695 471.0850 492.3755 509.4287 566.1261 612.5303 614.4892 621.5359 626.6423 654.3593 704.9034 712.3380 744.4523 753.5038 755.9418 766.8207 792.8438 806.8613 858.0340 880.4258 881.5595 886.7311 914.9562 938.5301 952.6291 956.9647 984.7364 988.0879 989.9305 990.5103 996.2635 999.7688 1022.9508 1030.4630 1033.1755 1087.5149 1091.1589 1106.3962 1152.3840 1167.0426 1174.0685 1175.3998 1188.0600 1196.4857 1234.9821 1258.1432 1286.3265 1304.2341 1320.7664 1370.5126 1376.2573 1405.4412 1430.5629 1439.8390 1444.2948 1463.5625 1478.0804 1488.7880 1583.8068 1593.6699 1594.5605 1606.8110 1615.0369 1616.8896 3126.6246 3127.5294 3128.6451 3135.4754 3138.0380 3139.7750 3149.2401 3149.6158 3152.0518 3157.7902 3165.7021 3166.8374 3168.5938
redmass: 4.1722 4.9225 5.9131 6.6266 5.1405 7.6200 3.8818 5.7097 7.1235 5.2947 4.9185 4.5978 4.6280 2.9446 5.9525 3.0632 4.0412 3.6881 3.6601 5.1920 3.3156 6.5505 6.4731 5.7696 6.0970 5.6047 1.8333 5.3133 2.6571 2.0470 1.5761 1.7668 2.4490 3.0484 1.2561 1.7658 2.7149 1.5560 6.0212 1.5478 1.4350 1.4262 1.4461 1.4924 3.6089 1.3525 5.7872 1.3406 2.2733 2.2576 1.9776 1.7606 2.1204 1.8279 2.1380 1.2732 1.0545 1.1156 1.8017 1.1230 2.1867 3.4111 1.5070 1.9098 1.3724 7.1796 8.1116 3.3538 2.2538 2.2585 2.7731 2.5624 2.2456 4.1243 5.9622 7.0545 6.5292 6.0965 7.3119 7.0135 1.0848 1.0857 1.0855 1.0883 1.0895 1.0897 1.0936 1.0943 1.0945 1.0955 1.1003 1.1002 1.1009
irintensity: 0.0035 0.0958 0.2768 0.6098 2.5012 0.7021 0.1695 1.9392 6.0930 2.6053 3.7292 0.1831 0.1175 0.1467 0.9273 5.0456 8.0018 6.9933 2.5825 0.2607 0.0179 2.0108 1.2603 27.2320 9.1964 59.9264 51.1162 8.2010 80.6336 114.4858 14.2141 28.5270 1.0754 3.6656 1.0502 3.1358 5.1269 0.3017 8.3562 0.3655 0.1623 0.3116 0.7588 0.0835 0.8721 0.4534 1.9928 0.0158 1.6100 6.8474 4.7122 4.1366 3.7163 4.3757 8.0438 1.2275 0.3391 1.2952 0.8074 3.7950 5.5796 28.8547 7.4462 0.5098 3.6295 2.8171 1.2895 0.2831 9.1355 42.9841 10.5261 3.9295 13.6983 0.4675 0.6633 0.2990 2.0142 0.8670 11.1402 2.9265 0.6205 3.0059 0.2701 5.2516 8.8554 2.3076 40.3753 4.4754 19.7556 20.1285 44.1680 21.4305 17.1682
temp: 298.150 k
press: 1.00000 atm
elementType: 35 6 6 6 6 6 6 6 6 6 6 6 6 6 6 6 6 6 6 6 1 1 1 1 1 1 1 1 1 1 1 1 1
symmnumber: 1
zpe: 666956.2 jmol-1
zpe.correction: 0.254030 hartree
zpe.thermalcorrener: 0.269657 hartree
zpe.thermalcorrenthalpy: 0.270601 hartree
zpe.thermalcorrgfe: 0.209947 hartree
zpe.sumelectzpe: -743.958702 hartree
zpe.sumelectthermal: -743.943075 hartree
zpe.sumelectthermalent: -743.942131 hartree
zpe.sumelectthermalfe: -744.002785 hartree
dipole: 0.1655 -0.0023 -2.7530
dipole: 2.7579
quadrupole: -107.3248 -110.5344 -130.2228
quadrupole: -2.3662 -2.8300 2.2778
quadrupole: 8.7025 5.4929 -14.1955 -2.3662 -2.8300 2.2778
hfenergy: -744.212732 hartree
pointgroup: C01 [X(C19H13Br1)]
dipole: 0.0220915 0.0076097 -1.0848036 debye
polarizability: 251.6300392|-10.0814646|253.0399699|-17.8372779|7.8655534|170.0880096 unknown
InChI: InChI=1S/C19H13Br/c20-19(14-8-2-1-3-9-14)17-12-6-4-10-15(17)16-11-5-7-13-18(16)19/h1-13H
charge 0 multiplicity 1
33 atoms
Br -0.329931 0.002917 2.83042
C  -0.274744 -0.039089 0.695859
C  0.525079 1.193157 0.271982
C  0.662561 -1.189365 0.35677
C  1.803212 0.791196 -0.220243
C  1.89047 -0.682254 -0.160468
C  -1.704931 -0.103176 0.173452
C  0.154513 2.547363 0.289863
C  0.460646 -2.5709 0.513528
C  2.725307 1.752855 -0.679437
C  2.927745 -1.564096 -0.526267
C  -1.991146 -0.890788 -0.974184
C  -2.744531 0.689864 0.72703
C  1.082817 3.513993 -0.170558
C  1.502225 -3.457214 0.143994
C  2.357577 3.119672 -0.646788
C  2.724903 -2.956718 -0.369717
C  -3.281927 -0.88494 -1.548876
C  -4.033552 0.691026 0.155306
C  -4.309465 -0.095304 -0.987859
H  -0.829206 2.856464 0.656747
H  -0.476403 -2.953118 0.932094
H  3.707772 1.454119 -1.061143
H  3.875123 -1.18546 -0.925469
H  -1.201824 -1.500133 -1.425044
H  -2.550982 1.274424 1.632235
H  0.812767 4.575498 -0.158722
H  1.365127 -4.537491 0.262224
H  3.062773 3.881081 -0.998212
H  3.521355 -3.65664 -0.64608
H  -3.482139 -1.500064 -2.433256
H  -4.824821 1.300085 0.606355
H  -5.312066 -0.096265 -1.429639
