program: Gaussian 09
title: 000231627
version: EM64L-G09RevD.01
frameworkgroup: C1[X(C21H18O2)]
method: RPBEPBE
basis: SDD
operation: Freq
keyword: #pfreq=noraman
keyword: PBEPBE/SDD
title: #p freq=noraman PBEPBE/SDD
converged: YES YES NO NO
title: Mulliken charges:
elementType: O O C C C C C C C C C C C C C C C C C C C C C H H H H H H H H H H H H H H H H H H
charge: -0.276576 -0.206562 -0.060807 0.306731 0.289973 0.370088 0.164618 -0.363225 -0.368232 -0.344811 -0.323507 -0.355224 -0.375336 -0.258134 -0.250521 -0.258181 -0.271745 -0.248134 -0.250149 -0.242792 -0.245589 -0.246628 -0.509964 0.257142 0.263708 0.236016 0.267542 0.278041 0.258900 0.224476 0.227886 0.226215 0.227130 0.225615 0.225862 0.226528 0.228403 0.227178 0.234831 0.243162 0.246070
chargesum: 0.00000
title: Mulliken charges with hydrogens summed into heavy atoms:
elementType: O O C C C C C C C C C C C C C C C C C C C C C
charge: -0.276576 -0.206562 -0.060807 0.306731 0.289973 0.370088 0.164618 -0.106083 -0.104525 -0.108795 -0.055966 -0.077183 -0.116436 -0.033658 -0.022635 -0.031966 -0.044615 -0.022518 -0.024286 -0.016263 -0.017186 -0.019450 0.214099
polarizability: 2.40274906e+02 2.53654487e+00 2.35370061e+02 4.02559088e+00 -2.25188404e+00 1.88705531e+02
1716.lowfreq: -10.5795 -7.8289 -0.0003 -0.0002 0.0002 3.0419 20.5543 32.5938 41.3831
frequency: 20.0620 32.2489 41.3811 59.8715 67.4211 75.2383 88.1815 98.2612 121.3384 122.1511 203.8701 228.3628 237.8101 258.1499 267.6400 287.0467 300.4174 305.9633 311.1720 376.4236 402.6810 403.7072 410.8824 493.5006 504.5792 515.4465 594.8891 616.0789 616.9175 618.4445 635.0971 663.3778 693.3747 703.4206 703.9662 708.2596 729.9702 762.1708 767.0837 770.7780 849.9613 853.6601 856.3914 862.9451 895.7393 910.4078 923.1746 938.9077 948.1737 975.2268 977.0152 979.3581 988.2377 991.0673 991.2717 991.7025 994.4351 995.4476 1000.6496 1029.6442 1032.0645 1034.4349 1086.7479 1090.0364 1090.9799 1110.9382 1124.3813 1145.9107 1148.1243 1172.6034 1173.2117 1173.4531 1177.3707 1195.3403 1198.0244 1201.0788 1203.8353 1320.8402 1324.5762 1328.8134 1371.6426 1376.6417 1377.7232 1418.2099 1430.8333 1434.6087 1435.8875 1452.3742 1463.0960 1478.7032 1482.1695 1483.2079 1585.0451 1588.4292 1590.3927 1605.8042 1608.8608 1610.5407 1630.2813 3004.2395 3106.4778 3118.1372 3122.7656 3123.5332 3126.8731 3134.4397 3134.8404 3139.7817 3149.5659 3152.0825 3152.4031 3152.6962 3163.2186 3164.5381 3166.3237 3170.1007 3179.6632
redmass: 3.8911 4.3217 6.5793 4.2759 4.6279 4.5362 3.2724 4.1214 1.1408 3.8329 4.9978 4.4695 4.3781 4.8475 5.5357 5.3438 5.0041 5.0469 4.2915 7.6884 2.8137 2.8602 2.9093 3.7777 3.9163 3.5593 6.0097 6.2910 6.3534 6.4365 6.2091 5.7446 7.6407 1.7743 1.7560 1.7596 3.0858 2.2905 2.1300 1.9952 1.3429 1.2559 2.7734 1.4093 3.2196 2.6204 1.5903 1.8066 2.1442 4.7906 1.4169 1.4022 1.5725 4.2365 4.8675 6.1930 1.3669 1.3264 1.3411 2.4119 2.2608 2.2175 1.7473 1.6764 1.6333 1.2984 4.7632 1.9833 2.0241 1.1390 1.0861 1.0802 2.6296 2.5641 1.2974 1.1377 1.1293 1.4018 1.3257 1.3311 5.9902 7.9820 8.1757 1.1752 2.2246 2.2470 2.2483 1.0508 1.0549 2.0799 2.1839 2.1262 5.8877 6.0620 6.1906 6.0181 5.9637 6.2279 9.5089 1.0294 1.1045 1.0860 1.0848 1.0849 1.0872 1.0895 1.0898 1.0926 1.1049 1.0946 1.0950 1.0948 1.0940 1.1006 1.0959 1.0987 1.0958
irintensity: 0.0082 0.1137 0.5229 0.2180 0.3847 0.0744 2.1138 0.4879 0.0178 0.9277 3.5733 2.0023 0.3558 1.7331 0.7713 3.9091 0.4043 3.3396 6.1061 7.9436 0.0803 0.1287 0.8474 7.0032 3.0991 2.8404 16.0219 0.0924 0.4192 1.7197 15.9710 11.2132 0.9361 55.4502 44.1251 40.0738 50.8852 22.3781 33.5158 31.1991 0.5245 0.2805 7.5681 1.1647 1.1584 1.4219 1.8652 0.7663 1.6001 37.9414 0.6450 0.6998 0.3331 1.4982 1.0630 1.6272 1.7536 0.6931 1.3613 2.3723 15.9354 11.0514 22.4021 2.3049 3.1134 8.2710 248.0160 3.7170 19.5059 0.7662 1.1713 0.1655 7.2438 0.8831 3.1056 6.6687 3.6369 0.4532 0.3901 1.7622 0.2624 0.4325 0.5668 17.1351 9.5754 10.6096 6.2683 12.0982 9.6156 38.2727 21.1253 26.1708 0.3136 0.1094 7.9514 18.8850 8.1198 20.2067 136.6820 35.9224 21.1015 6.0768 0.0141 0.2381 1.3705 14.5897 14.5949 26.2313 13.2236 50.9822 30.2270 8.5084 12.7293 19.3469 20.3392 15.7519 4.7401
temp: 298.150 k
press: 1.00000 atm
elementType: 8 8 6 6 6 6 6 6 6 6 6 6 6 6 6 6 6 6 6 6 6 6 6 1 1 1 1 1 1 1 1 1 1 1 1 1 1 1 1 1 1
symmnumber: 1
zpe: 855269.8 jmol-1
zpe.correction: 0.325755 hartree
zpe.thermalcorrener: 0.345712 hartree
zpe.thermalcorrenthalpy: 0.346656 hartree
zpe.thermalcorrgfe: 0.275530 hartree
zpe.sumelectzpe: -959.869028 hartree
zpe.sumelectthermal: -959.849071 hartree
zpe.sumelectthermalent: -959.848127 hartree
zpe.sumelectthermalfe: -959.919253 hartree
dipole: -1.7179 0.0398 -0.4176
dipole: 1.7684
quadrupole: -123.7236 -123.0225 -127.7676
quadrupole: 0.0547 -7.8041 -1.2894
quadrupole: 1.1143 1.8154 -2.9297 0.0547 -7.8041 -1.2894
hfenergy: -960.194783 hartree
pointgroup: C01 [X(C21H18O2)]
dipole: 0.5527526 0.3762201 -0.1922797 debye
polarizability: 236.2764323|2.6830632|238.7937726|-3.445896|-6.4070525|189.2802927 unknown
InChI: InChI=1S/C21H18O2/c1-23-20(22)21(17-11-5-2-6-12-17,18-13-7-3-8-14-18)19-15-9-4-10-16-19/h2-16H,1H3
charge 0 multiplicity 1
41 atoms
O  1.26706 1.318122 2.024681
O  -0.272928 -0.189863 2.853399
C  0.011674 0.036914 0.354753
C  -1.406187 -0.589253 0.209567
C  1.123509 -0.979927 -0.079779
C  0.115717 1.345716 -0.473736
C  0.273962 0.348362 1.867629
C  -2.339139 -0.097763 -0.737326
C  0.808367 -2.155516 -0.806162
C  -0.527912 2.524104 -0.01373
C  -1.776845 -1.719938 0.98852
C  2.492219 -0.696756 0.179098
C  0.755363 1.37797 -1.735022
C  -3.609392 -0.70133 -0.891104
C  1.827078 -3.034365 -1.241841
C  -0.51365 3.706876 -0.780467
C  -3.044649 -2.319077 0.840037
C  3.508282 -1.576574 -0.250043
C  0.769394 2.561527 -2.50991
C  -3.972066 -1.812303 -0.100278
C  3.182137 -2.754554 -0.961163
C  0.138804 3.732553 -2.036192
C  1.635617 1.629872 3.427692
H  -2.082889 0.7608 -1.364224
H  -0.234137 -2.390958 -1.037204
H  -1.048835 2.51642 0.951326
H  -1.074275 -2.129441 1.718157
H  2.759949 0.225091 0.703684
H  1.248947 0.47971 -2.118457
H  -4.310601 -0.298326 -1.630723
H  1.555912 -3.936063 -1.802594
H  -1.012254 4.60635 -0.401878
H  -3.306629 -3.184316 1.459418
H  4.555948 -1.337564 -0.034221
H  1.273244 2.564014 -3.483147
H  -4.957152 -2.278622 -0.215356
H  3.970832 -3.438101 -1.295096
H  0.152494 4.650728 -2.634199
H  2.395005 2.419953 3.346146
H  2.041126 0.731918 3.92389
H  0.751097 1.981408 3.984458
