program: Gaussian 09
title: 000231610
version: EM64L-G09RevD.01
frameworkgroup: C1[X(C13H14O2)]
method: RPBEPBE
basis: SDD
operation: Freq
keyword: #pfreq=noraman
keyword: PBEPBE/SDD
title: #p freq=noraman PBEPBE/SDD
converged: YES YES NO NO
title: Mulliken charges:
elementType: O O C C C C C C C C C C C C C H H H H H H H H H H H H H H
charge: -0.264543 -0.437632 0.510123 0.377792 0.412178 -0.587602 -0.622188 -0.415482 -0.431748 -0.561044 -0.410709 -0.318187 0.321492 -0.366594 -0.537021 0.198721 0.230828 0.246399 0.229119 0.231986 0.249554 0.240434 0.230964 0.198958 0.252481 0.332373 0.245477 0.221903 0.221969
chargesum: 0.00000
title: Mulliken charges with hydrogens summed into heavy atoms:
elementType: O O C C C C C C C C C C C C C
charge: -0.264543 -0.105260 0.510123 0.377792 0.412178 -0.158053 -0.375789 -0.186363 -0.199762 -0.311490 -0.170275 0.111735 0.321492 -0.114113 0.152329
polarizability: 2.51400007e+02 8.64732780e+00 1.44422788e+02 1.28259913e+01 9.89716494e-01 7.70800429e+01
1716.lowfreq: -20.0434 -7.1299 -0.0005 0.0004 0.0005 4.9586 26.5533 42.3053 89.8108
frequency: 22.6421 41.9975 89.7693 98.3325 137.1545 173.2558 188.2195 221.9843 250.4174 270.7345 300.1048 325.8986 384.4672 392.0462 401.6789 442.1159 477.4216 500.5761 519.1041 568.1554 612.2084 664.7582 685.0484 749.6636 776.1646 795.8173 811.1024 822.6938 834.2502 872.9038 907.2878 916.6318 954.7381 957.0653 966.9427 971.7099 996.2279 1018.8235 1032.5923 1114.2012 1118.6494 1122.8738 1153.3975 1158.6615 1181.5855 1184.5767 1254.2413 1257.8329 1262.0471 1276.9514 1281.3642 1332.7302 1340.0437 1372.0264 1408.9076 1417.2509 1432.0063 1438.4539 1465.8789 1465.9596 1472.5813 1481.2440 1482.3631 1513.1683 1583.5170 1611.6417 1641.7813 2958.5552 2959.3526 2972.6940 3045.8784 3047.3790 3087.0387 3110.2434 3113.1827 3125.5487 3130.4379 3135.9185 3147.6065 3169.6373 3560.9449
redmass: 3.6448 5.2822 2.2056 3.4739 4.4362 3.4657 3.3354 1.5414 2.9984 2.1962 2.0249 1.8234 3.4613 4.3547 3.1674 5.5288 2.5222 3.9738 6.4095 3.2915 4.7893 4.5203 4.3717 5.2510 2.2679 1.1768 1.5094 1.4256 3.6697 1.7743 1.7086 4.1312 3.6447 2.5088 1.6638 1.3961 4.5211 2.4194 2.3479 1.2635 1.2369 1.4498 1.3417 1.3619 1.4896 1.6069 1.8817 1.9942 1.6950 1.8143 1.2521 1.3487 1.6619 1.2018 2.8859 5.0603 2.3571 1.9435 1.0855 1.0532 1.1109 1.1001 2.3486 3.9055 7.6652 5.9077 6.8153 1.0332 1.0685 1.0640 1.1038 1.0953 1.0981 1.0866 1.0914 1.0993 1.0891 1.0973 1.0908 1.0959 1.0661
irintensity: 1.4658 0.3996 3.2143 6.6332 2.0911 4.2492 1.9711 1.4846 9.8748 1.6443 34.2204 126.4255 4.9091 6.9937 0.2738 11.0270 18.0505 3.5513 0.3641 4.2786 3.8126 4.1797 6.8635 2.0125 0.1741 2.6780 0.9922 32.3401 10.0780 71.7466 17.2889 5.8347 1.4705 91.6602 42.0576 4.5788 56.0346 22.2644 48.7677 0.2908 37.2047 8.7395 4.2169 2.9406 21.6830 112.8604 15.7990 85.3648 42.0911 4.3279 3.0361 5.1554 6.9777 27.7599 2.5705 16.9091 26.4917 5.9952 2.4229 14.3325 59.7010 10.0008 20.0408 24.7059 4.4096 110.4859 34.3615 56.7437 58.1443 50.8797 48.9648 13.8928 25.1596 8.4171 18.4284 28.7057 13.2614 24.1197 12.6611 9.2472 10.7745
temp: 298.150 k
press: 1.00000 atm
elementType: 8 8 6 6 6 6 6 6 6 6 6 6 6 6 6 1 1 1 1 1 1 1 1 1 1 1 1 1 1
symmnumber: 1
zpe: 619325.0 jmol-1
zpe.correction: 0.235888 hartree
zpe.thermalcorrener: 0.249780 hartree
zpe.thermalcorrenthalpy: 0.250724 hartree
zpe.thermalcorrgfe: 0.194220 hartree
zpe.sumelectzpe: -653.129537 hartree
zpe.sumelectthermal: -653.115646 hartree
zpe.sumelectthermalent: -653.114702 hartree
zpe.sumelectthermalfe: -653.171206 hartree
dipole: 1.5012 -2.8037 -0.8572
dipole: 3.2938
quadrupole: -86.6082 -78.5500 -94.3649
quadrupole: 0.6391 8.7984 -1.0682
quadrupole: -0.1005 7.9577 -7.8572 0.6391 8.7984 -1.0682
hfenergy: -653.3654259 hartree
pointgroup: C01 [X(C13H14O2)]
dipole: -0.536258 -1.1563889 0.2334728 debye
polarizability: 251.6839602|-4.2861686|143.393274|14.5956286|5.2765183|77.8256035 unknown
InChI: InChI=1S/C13H14O2/c1-15-13-5-4-11-8-10(6-7-14)2-3-12(11)9-13/h2-5,8-9,14H,6-7H2,1H3
charge 0 multiplicity 1
29 atoms
O  -4.333784 0.066382 -0.31154
O  5.802455 0.54962 -0.568305
C  2.15373 -0.083462 0.487891
C  -0.175882 0.722161 0.274433
C  -0.642698 -0.633876 0.075318
C  3.640858 0.185141 0.653734
C  1.220412 0.961686 0.478315
C  1.679633 -1.42426 0.288454
C  0.324049 -1.693018 0.089818
C  -2.041539 -0.88428 -0.124505
C  -1.141206 1.786458 0.264536
C  4.375823 0.224951 -0.711011
C  -2.947652 0.182501 -0.127369
C  -2.493405 1.529559 0.068146
C  -4.874373 -1.279168 -0.51307
H  4.103845 -0.603128 1.282885
H  3.812959 1.151332 1.162284
H  1.559781 1.99451 0.631929
H  2.401661 -2.250594 0.304683
H  -0.016909 -2.725563 -0.054108
H  -2.37346 -1.917026 -0.2721
H  -0.798274 2.816898 0.414607
H  3.9693 1.033936 -1.33963
H  4.236222 -0.737109 -1.24905
H  -3.238786 2.330344 0.057484
H  6.242209 -0.156595 -0.030592
H  -5.958928 -1.140781 -0.63183
H  -4.673136 -1.927338 0.362287
H  -4.454709 -1.747682 -1.424795
