program: Gaussian 09
title: 000231598
version: EM64L-G09RevD.01
frameworkgroup: C1[X(C9H20O2)]
method: RPBEPBE
basis: SDD
operation: Freq
keyword: #pfreq=noraman
keyword: PBEPBE/SDD
title: #p freq=noraman PBEPBE/SDD
converged: YES YES NO NO
title: Mulliken charges:
elementType: O O C C C C C C C C C H H H H H H H H H H H H H H H H H H H H
charge: -0.278581 -0.275515 0.075132 -0.391631 0.034361 0.064419 -0.702079 -0.689249 -0.691000 -0.701637 -0.689724 0.149490 0.207326 0.228520 0.191799 0.219641 0.198666 0.223384 0.231867 0.197174 0.228370 0.224877 0.210539 0.218724 0.220123 0.195292 0.237835 0.218688 0.210844 0.206623 0.225720
chargesum: 0.00000
title: Mulliken charges with hydrogens summed into heavy atoms:
elementType: O O C C C C C C C C C
charge: -0.278581 -0.275515 0.224622 0.044215 0.226160 0.284061 -0.048162 -0.038828 -0.041615 -0.049822 -0.046537
polarizability: 1.22648061e+02 -1.44760255e-01 1.09379877e+02 -2.92309875e-01 -8.46922096e-01 9.27094110e+01
1716.lowfreq: -11.4982 0.0009 0.0009 0.0011 8.2863 10.1641 40.7115 64.5039 74.8407
frequency: 40.4196 64.3185 74.8057 80.8198 112.9862 134.5024 183.8242 191.2518 198.5227 222.8669 236.2385 245.1727 273.4049 295.8141 312.8886 372.1882 402.3161 416.5649 426.6515 464.2360 495.7482 565.6603 735.4520 795.0294 821.3735 864.3231 894.0733 909.7335 913.9152 920.9921 928.7131 935.5696 939.2359 1034.2613 1062.4695 1081.5173 1109.8450 1114.2050 1137.9606 1145.8212 1158.6489 1179.1712 1186.9558 1253.7863 1278.1077 1306.1048 1312.9458 1329.6332 1343.1236 1356.6891 1368.4255 1376.1202 1377.9732 1387.7425 1391.2038 1392.8904 1453.1934 1453.9846 1456.4602 1463.5664 1465.0274 1470.2421 1472.2852 1477.4054 1483.6222 1486.9239 1490.2564 2893.0473 2957.9059 2975.4263 2977.4474 2978.0774 2988.6357 2989.1067 3004.2685 3005.1235 3054.8711 3068.2516 3072.6529 3075.7734 3081.5831 3082.5717 3086.2037 3089.6542 3089.7749 3096.1878 3100.5491
redmass: 2.5946 2.7224 2.7380 3.0777 2.2967 2.9350 1.7189 1.0523 1.4283 1.4441 1.1498 1.1460 1.6611 2.4417 2.6148 2.8902 2.6268 2.6983 3.0076 2.9395 2.4049 3.4038 1.7870 2.7667 2.0966 2.1818 2.3626 1.7080 1.3567 1.3601 2.8176 1.4443 1.3465 5.3277 2.3255 1.7842 1.8238 1.8236 2.2056 2.1494 2.1219 2.0354 2.0660 1.2262 1.1812 1.2041 1.2328 1.4080 1.4182 1.5579 1.2123 1.2497 1.2865 1.2179 1.2320 1.2333 1.0721 1.0532 1.0496 1.0495 1.0494 1.0471 1.0516 1.0469 1.0500 1.0477 1.0524 1.0826 1.0834 1.0374 1.0355 1.0353 1.0357 1.0357 1.0767 1.0685 1.0983 1.0987 1.0987 1.0992 1.1002 1.1005 1.1011 1.0994 1.0992 1.1000 1.0999
irintensity: 0.3230 0.5454 0.7343 1.2036 4.4531 0.6924 0.0934 0.0713 0.1959 1.1009 1.0768 0.1370 1.0022 0.6287 1.2484 5.7589 1.9412 3.2720 2.3335 4.1316 3.0059 1.1571 9.7526 3.4309 6.5990 63.5587 17.4557 2.7998 11.0219 7.4329 191.6127 23.3812 1.0868 136.2026 27.7014 41.4317 24.7407 29.2935 6.3707 8.8418 33.3557 19.1294 14.9170 2.9698 16.7780 31.5484 17.5314 6.9162 4.9694 6.0082 11.6731 22.3340 35.6453 18.2922 22.8592 16.4393 4.2402 5.1693 4.7784 5.2448 2.4987 9.5822 8.4134 10.1380 14.1221 15.9115 17.3419 50.6709 37.9194 39.4713 27.7579 21.5997 30.6477 16.5601 4.8206 32.2899 6.2569 51.9201 31.2630 43.7944 5.8535 12.8125 52.4570 66.8032 55.4032 40.4879 34.6598
temp: 298.150 k
press: 1.00000 atm
elementType: 8 8 6 6 6 6 6 6 6 6 6 1 1 1 1 1 1 1 1 1 1 1 1 1 1 1 1 1 1 1 1
symmnumber: 1
zpe: 723712.6 jmol-1
zpe.correction: 0.275648 hartree
zpe.thermalcorrener: 0.290574 hartree
zpe.thermalcorrenthalpy: 0.291518 hartree
zpe.thermalcorrgfe: 0.234194 hartree
zpe.sumelectzpe: -504.447682 hartree
zpe.sumelectthermal: -504.432755 hartree
zpe.sumelectthermalent: -504.431811 hartree
zpe.sumelectthermalfe: -504.489135 hartree
dipole: -0.6268 -1.3805 2.0323
dipole: 2.5355
quadrupole: -67.1983 -68.6347 -71.7570
quadrupole: -1.5376 -0.5668 0.6014
quadrupole: 1.9984 0.5620 -2.5604 -1.5376 -0.5668 0.6014
hfenergy: -504.7233291 hartree
pointgroup: C01 [X(C9H20O2)]
dipole: -0.3166464 -0.308212 0.8943421 debye
polarizability: 118.7925014|-5.8201298|112.1222324|-4.874575|-1.0438576|93.8226145 unknown
InChI: InChI=1S/C9H20O2/c1-6-9(10-7(2)3)11-8(4)5/h7-9H,6H2,1-5H3
charge 0 multiplicity 1
31 atoms
O  -0.882496 0.192823 -0.457179
O  1.49864 0.165643 -0.587126
C  0.367449 0.781825 0.067205
C  0.452725 2.273734 -0.282468
C  -1.923975 -0.149774 0.55056
C  1.709676 -1.283473 -0.319618
C  -0.663337 3.119469 0.361653
C  -3.251196 -0.137927 -0.219406
C  -1.640679 -1.512039 1.212429
C  2.586791 -1.780263 -1.474253
C  2.369467 -1.490406 1.05812
H  0.39627 0.620946 1.172439
H  1.448127 2.640006 0.032584
H  0.407929 2.352025 -1.384046
H  -1.943453 0.64038 1.331845
H  0.722003 -1.783387 -0.357729
H  -0.641114 3.053691 1.466856
H  -0.548107 4.184295 0.090715
H  -1.658175 2.788678 0.013686
H  -4.095261 -0.383249 0.450878
H  -3.429707 0.854197 -0.668474
H  -3.221235 -0.88234 -1.034828
H  -2.428529 -1.752113 1.951008
H  -0.670233 -1.514464 1.741526
H  -1.624556 -2.310322 0.448644
H  2.801709 -2.859235 -1.365489
H  2.077583 -1.613944 -2.438469
H  3.545089 -1.230574 -1.489584
H  2.514942 -2.568474 1.258059
H  1.752325 -1.077463 1.877556
H  3.355327 -0.992764 1.085807
