program: Gaussian 09
title: 000231584
version: EM64L-G09RevD.01
frameworkgroup: C1[X(C9H18O)]
method: RPBEPBE
basis: SDD
operation: Freq
keyword: #pfreq=noraman
keyword: PBEPBE/SDD
title: #p freq=noraman PBEPBE/SDD
converged: YES YES NO NO
title: Mulliken charges:
elementType: O C C C C C C C C C H H H H H H H H H H H H H H H H H H
charge: -0.204932 0.183751 -0.511828 -0.037960 0.165516 -0.717689 -0.700453 -0.703393 -0.708857 -0.713782 0.233353 0.225369 0.232836 0.216828 0.222827 0.221295 0.219762 0.210003 0.231339 0.199289 0.237082 0.219175 0.242494 0.193558 0.212646 0.218974 0.210765 0.202030
chargesum: 0.00000
title: Mulliken charges with hydrogens summed into heavy atoms:
elementType: O C C C C C C C C C
charge: -0.204932 0.183751 -0.053106 0.194876 0.165516 -0.056738 -0.039349 -0.047846 -0.060159 -0.082013
polarizability: 1.12666298e+02 6.56524471e-01 9.49480057e+01 -9.01706446e-01 1.43523284e+00 8.88424896e+01
1716.lowfreq: -9.9689 0.0003 0.0005 0.0007 6.0193 11.3821 34.4060 43.1139 85.4338
frequency: 33.5204 43.0635 85.4173 136.4703 166.2991 206.7325 211.5367 234.4941 236.2406 253.6641 263.4962 287.9243 341.1756 356.0872 363.1456 379.9806 418.2567 466.7195 555.7940 586.8526 751.1821 825.6579 834.8426 876.5259 919.0384 926.5128 934.6494 948.0355 949.5492 961.8007 1000.8884 1010.7797 1056.6232 1098.9938 1143.5211 1181.7532 1196.6567 1220.8272 1227.9141 1248.3783 1285.9446 1326.7250 1346.1002 1371.6014 1377.1422 1377.7012 1394.7072 1401.4508 1425.6292 1454.3480 1462.9488 1464.8077 1468.3239 1471.8684 1476.8694 1481.3796 1482.1305 1489.3407 1495.4102 1609.6637 2954.1855 2964.0532 2969.7565 2975.0010 2977.5454 2987.3842 2997.9733 3020.2815 3054.8599 3064.5438 3068.9628 3069.4772 3072.7960 3078.6818 3082.0709 3082.4729 3082.8781 3098.9146
redmass: 3.8392 2.4631 2.9242 3.1845 1.0639 1.5222 1.0521 1.1180 1.5544 1.6806 1.3460 2.3498 2.5844 2.7413 2.2248 2.2254 2.1855 2.7453 3.2573 2.6666 4.5613 2.7352 2.6733 1.7468 1.1807 1.7248 1.5674 1.2027 1.7583 1.6057 1.4783 1.4720 1.8564 1.6733 2.3690 1.8455 2.5269 1.7273 2.2073 2.1227 1.7735 1.5506 1.5149 1.1810 1.1984 1.2151 1.2164 1.2030 1.0895 1.0506 1.0487 1.0503 1.0494 1.0494 1.0543 1.0540 1.0540 1.0465 1.0665 9.0710 1.0623 1.0360 1.0380 1.0343 1.0351 1.0362 1.0840 1.0936 1.0987 1.0985 1.0986 1.1001 1.0996 1.1003 1.0993 1.0992 1.0992 1.0988
irintensity: 1.2270 0.0364 1.9524 1.8094 0.1096 0.1262 0.0409 0.0901 1.0112 2.0033 0.1538 1.1124 3.5617 2.9836 0.1540 0.6643 1.2283 0.4336 2.4406 0.2232 2.3222 3.1208 9.9913 6.4464 5.3147 2.7545 3.9585 0.3209 21.3734 4.3570 9.7192 2.5948 36.8844 7.8223 14.5590 16.5716 5.7781 6.5220 4.4895 8.1471 14.2369 11.9965 19.8641 17.4215 26.7284 23.4952 8.4211 12.5772 13.5720 1.5671 1.6698 0.4680 3.0986 2.6817 18.8584 16.2427 3.6213 31.6348 28.0136 96.8526 22.9848 38.1523 21.4711 34.4699 24.1758 28.4447 0.2916 13.6283 19.7186 48.7976 75.9841 11.5618 21.0751 14.1119 57.4743 27.0307 65.1296 28.2263
temp: 298.150 k
press: 1.00000 atm
elementType: 8 6 6 6 6 6 6 6 6 6 1 1 1 1 1 1 1 1 1 1 1 1 1 1 1 1 1 1
symmnumber: 1
zpe: 653202.5 jmol-1
zpe.correction: 0.248792 hartree
zpe.thermalcorrener: 0.262113 hartree
zpe.thermalcorrenthalpy: 0.263057 hartree
zpe.thermalcorrgfe: 0.209449 hartree
zpe.sumelectzpe: -428.147496 hartree
zpe.sumelectthermal: -428.134174 hartree
zpe.sumelectthermalent: -428.133230 hartree
zpe.sumelectthermalfe: -428.186838 hartree
dipole: -0.3968 2.3335 1.5379
dipole: 2.8227
quadrupole: -61.6476 -67.2240 -65.7605
quadrupole: -0.8239 -1.1748 -3.2582
quadrupole: 3.2297 -2.3467 -0.8831 -0.8239 -1.1748 -3.2582
hfenergy: -428.3962873 hartree
pointgroup: C01 [X(C9H18O1)]
dipole: 0.1702781 -1.073876 0.2261074 debye
polarizability: 112.6372755|0.5291281|95.1155477|1.2413435|1.0618461|88.7039696 unknown
InChI: InChI=1S/C9H18O/c1-7(2)6-8(10)9(3,4)5/h7H,6H2,1-5H3
charge 0 multiplicity 1
28 atoms
O  0.180947 1.632851 -0.496096
C  1.740237 -0.158518 0.124231
C  -0.850054 -0.562238 -0.284173
C  -2.235233 0.116661 -0.155916
C  0.339929 0.407929 -0.240069
C  2.012113 -1.489202 -0.631854
C  1.74927 -0.422212 1.663126
C  2.833977 0.878779 -0.224861
C  -2.448125 0.68132 1.268607
C  -3.359249 -0.873923 -0.536392
H  -0.786003 -1.093313 -1.259182
H  -0.731507 -1.347366 0.488872
H  -2.25018 0.969014 -0.862992
H  3.009087 -1.874938 -0.348882
H  1.269306 -2.268936 -0.387304
H  2.007419 -1.336318 -1.726972
H  2.741189 -0.809966 1.960815
H  0.990271 -1.167781 1.96252
H  1.562498 0.510324 2.225896
H  3.827408 0.495539 0.073682
H  2.650651 1.836032 0.291208
H  2.850368 1.089444 -1.30908
H  -1.668903 1.421118 1.52325
H  -2.423397 -0.129902 2.023053
H  -3.429128 1.18493 1.348287
H  -4.351167 -0.391126 -0.461215
H  -3.240417 -1.244225 -1.572447
H  -3.362804 -1.751775 0.139388
