program: Gaussian 09
title: 000231586
version: EM64L-G09RevD.01
frameworkgroup: C1[X(C12H22O2)]
method: RPBEPBE
basis: SDD
operation: Freq
keyword: #pfreq=noraman
keyword: PBEPBE/SDD
title: #p freq=noraman PBEPBE/SDD
converged: YES YES NO NO
title: Mulliken charges:
elementType: O O C C C C C C C C C C C C H H H H H H H H H H H H H H H H H H H H H H
charge: -0.195248 -0.179979 0.160808 0.178388 -0.294123 0.195662 0.172141 -0.698368 -0.733905 -0.710726 -0.725861 -0.708510 -0.706185 -0.723630 0.242298 0.216933 0.215129 0.248865 0.209914 0.220831 0.223905 0.217158 0.210562 0.252077 0.219132 0.199438 0.247176 0.222809 0.207278 0.238178 0.200061 0.228339 0.242278 0.205399 0.264520 0.237256
chargesum: 0.00000
title: Mulliken charges with hydrogens summed into heavy atoms:
elementType: O O C C C C C C C C C C C C
charge: -0.195248 -0.179979 0.160808 0.178388 -0.051825 0.195662 0.172141 -0.017440 -0.079255 -0.030930 -0.060114 -0.040245 -0.035507 -0.016455
polarizability: 1.51015147e+02 1.99445933e+00 1.28348955e+02 -2.18519779e+00 -1.54714559e-01 1.19639495e+02
1716.lowfreq: -18.9221 -10.9135 -0.0007 -0.0005 0.0003 7.8972 14.4831 43.4716 51.0128
frequency: 10.5880 43.3243 50.9717 63.1479 117.3878 157.0455 170.1996 178.9040 191.8785 204.9606 218.1344 226.0655 246.3182 247.2983 258.0375 268.4053 277.7213 295.3788 319.8990 334.4344 349.8509 356.0009 367.9212 370.9811 437.1895 472.5531 534.5071 569.2663 620.6727 716.9130 731.8873 794.5320 818.2673 827.3909 923.7975 927.7214 934.4426 936.6482 948.3500 950.0519 960.5452 984.9595 992.5991 1010.8787 1020.7283 1033.4171 1041.8358 1080.6720 1099.5126 1189.9675 1193.2011 1214.9809 1229.7265 1238.4440 1245.7619 1260.0751 1301.6305 1369.2302 1370.0724 1374.4152 1379.4648 1385.3198 1400.7999 1403.2242 1452.8430 1452.9783 1463.9742 1465.0449 1466.3473 1467.4617 1468.9611 1472.7185 1474.9336 1478.3845 1481.3024 1485.7109 1497.3808 1498.8739 1590.0826 1621.6600 2971.5562 2972.7115 2978.2373 2979.9447 2983.2035 2988.8172 2999.7613 3024.2511 3063.3995 3064.2802 3068.4342 3071.2757 3073.8876 3078.5309 3082.7901 3083.0796 3090.6797 3094.1316 3095.9605 3101.5685 3104.1234 3115.2319
redmass: 3.0002 4.1598 3.5763 3.5744 5.4097 1.6509 1.1472 1.3266 1.1638 2.2202 1.5708 2.0694 1.6193 1.4826 1.3713 1.1721 1.2424 2.8428 3.1390 2.7038 2.7421 3.2704 2.3367 2.3290 2.8111 3.1822 4.1181 3.3379 4.9283 3.5282 5.0360 3.2213 2.8351 2.5656 1.7759 1.7846 1.5426 1.5523 1.2104 1.2199 3.2254 2.1267 1.4730 1.3903 1.5298 1.5004 1.6010 1.5879 2.9716 2.4751 2.7006 2.1249 3.3080 2.7277 2.3076 2.1347 1.6934 1.1772 1.1805 1.1899 1.1959 1.1820 1.2082 1.2038 1.0488 1.0487 1.0485 1.0483 1.0494 1.0505 1.0539 1.0496 1.0518 1.0545 1.0533 1.0506 1.0633 1.0636 8.2330 10.3994 1.0359 1.0345 1.0354 1.0346 1.0355 1.0363 1.0348 1.0817 1.0990 1.0992 1.0986 1.0998 1.0999 1.0988 1.1000 1.1006 1.0997 1.1003 1.1001 1.0996 1.0990 1.1004
irintensity: 0.7183 1.1386 1.1022 1.7557 1.1177 0.2772 0.2029 0.3274 0.0741 0.8384 0.4547 2.4536 0.4032 0.1396 0.2227 0.0513 0.2766 2.7506 2.7736 0.8038 3.2537 7.0447 0.3508 0.2912 0.7616 1.1649 3.0825 1.6169 0.6876 0.9997 0.5428 0.4357 2.6485 4.3636 2.5893 3.1836 4.6037 6.4259 0.5056 0.6070 56.7623 107.3027 7.4451 1.0957 8.2793 37.9550 5.5844 19.1806 39.2239 14.4768 6.5998 7.0204 5.7272 26.8181 4.3868 29.5525 45.3297 13.2342 21.4061 22.0001 25.1408 23.3527 13.6323 14.6185 1.0233 0.5165 2.5364 1.5475 1.5819 3.5203 7.0070 12.4792 7.3234 15.9032 29.8586 14.1398 43.4936 27.1877 43.7490 118.5356 18.4256 32.6097 25.1363 31.5365 26.1416 25.1735 25.4877 12.1806 25.5167 7.0994 85.3119 3.4937 35.9643 79.1287 27.5911 14.4059 30.1993 14.3881 18.1179 22.1761 22.1525 11.5203
temp: 298.150 k
press: 1.00000 atm
elementType: 8 8 6 6 6 6 6 6 6 6 6 6 6 6 1 1 1 1 1 1 1 1 1 1 1 1 1 1 1 1 1 1 1 1 1 1
symmnumber: 1
zpe: 820488.8 jmol-1
zpe.correction: 0.312508 hartree
zpe.thermalcorrener: 0.330752 hartree
zpe.thermalcorrenthalpy: 0.331697 hartree
zpe.thermalcorrgfe: 0.266367 hartree
zpe.sumelectzpe: -619.776126 hartree
zpe.sumelectthermal: -619.757881 hartree
zpe.sumelectthermalent: -619.756937 hartree
zpe.sumelectthermalfe: -619.822266 hartree
dipole: -1.7923 -2.0121 3.9478
dipole: 4.7797
quadrupole: -84.0359 -89.5594 -93.1330
quadrupole: -5.6096 1.5017 3.1671
quadrupole: 4.8735 -0.6500 -4.2236 -5.6096 1.5017 3.1671
hfenergy: -620.0886335 hartree
pointgroup: C01 [X(C12H22O2)]
dipole: 0.6333823 1.6476567 0.6482977 debye
polarizability: 150.7296174|3.6982883|124.6010515|2.2048809|-4.0792772|123.6729278 unknown
InChI: InChI=1S/C12H22O2/c1-8(9(13)11(2,3)4)10(14)12(5,6)7/h8H,1-7H3
charge 0 multiplicity 1
36 atoms
O  0.856135 -1.192324 -0.9670
O  -2.036975 -1.770054 0.64409
C  2.292892 0.426841 0.1588
C  -2.282779 0.487154 -0.273607
C  -0.129302 -0.32156 1.084449
C  0.979359 -0.400844 0.005982
C  -1.51496 -0.639756 0.471408
C  3.425461 -0.596017 0.493919
C  2.234663 1.51953 1.252659
C  2.605841 1.079799 -1.219109
C  -1.350235 1.43656 -1.068977
C  -3.022747 1.299705 0.839463
C  -3.324495 -0.144961 -1.229343
C  0.212755 -1.329991 2.217159
H  -0.147267 0.70199 1.500505
H  4.399709 -0.073361 0.513274
H  3.271722 -1.070711 1.48017
H  3.465549 -1.389346 -0.272066
H  1.465666 2.283824 1.031659
H  2.034364 1.101068 2.255732
H  3.209191 2.039616 1.300943
H  1.845743 1.836391 -1.487805
H  3.590972 1.579992 -1.180182
H  2.624841 0.31301 -2.011334
H  -1.958866 2.22857 -1.54336
H  -0.607913 1.939055 -0.421131
H  -0.810928 0.895609 -1.865633
H  -3.604247 2.115259 0.371035
H  -2.318153 1.75813 1.559097
H  -3.721574 0.652669 1.398722
H  -3.943226 0.64653 -1.691217
H  -2.823844 -0.713374 -2.03335
H  -3.981651 -0.844604 -0.687135
H  1.197363 -1.113762 2.667135
H  0.213166 -2.356513 1.817018
H  -0.553531 -1.279023 3.00963
