program: Gaussian 09
title: 000231560
version: EM64L-G09RevD.01
frameworkgroup: C1[X(C11H14O3)]
method: RPBEPBE
basis: SDD
operation: Freq
keyword: #pfreq=noraman
keyword: PBEPBE/SDD
title: #p freq=noraman PBEPBE/SDD
converged: YES YES NO NO
title: Mulliken charges:
elementType: O O O C C C C C C C C C C C H H H H H H H H H H H H H H
charge: -0.290010 -0.246363 -0.434678 -0.036183 -0.360103 -0.136681 -0.430720 0.345878 -0.320790 -0.377596 -0.367009 -0.214647 -0.218970 -0.237141 0.222170 0.214724 0.234914 0.253977 0.241526 0.194128 0.245885 0.179898 0.262380 0.258757 0.230171 0.227619 0.229364 0.329503
chargesum: 0.00000
title: Mulliken charges with hydrogens summed into heavy atoms:
elementType: O O O C C C C C C C C C C C
charge: -0.290010 -0.246363 -0.105175 0.185987 0.089534 0.117295 0.004933 0.345878 0.104994 -0.115216 -0.108253 0.015524 0.008649 -0.007778
polarizability: 1.41487443e+02 -5.98627597e+00 1.28847893e+02 1.10791551e+01 3.36498060e+00 9.01238723e+01
1716.lowfreq: -10.2701 -7.5095 -0.0010 -0.0009 -0.0008 8.2555 19.5668 35.9658 81.2247
frequency: 18.1695 35.9145 81.2033 95.9550 109.9978 153.5879 185.0302 217.4200 296.2319 322.0493 336.4250 365.1226 403.5772 435.2235 456.9193 481.1879 605.0494 613.6002 639.4009 706.2101 719.6454 738.6100 763.8296 823.4268 845.9375 861.3815 871.3764 914.4610 938.2478 940.6712 971.4420 987.6642 989.1671 998.9737 1003.8186 1024.9687 1035.0674 1044.3763 1079.3332 1089.4422 1103.2579 1161.2251 1171.4101 1181.3098 1190.7551 1204.9682 1240.2511 1258.0198 1280.0030 1295.9781 1306.6590 1313.4180 1322.0909 1341.6791 1363.0545 1382.3061 1387.9088 1433.4384 1450.2650 1468.4220 1477.0465 1482.2010 1591.8818 1611.7785 2949.5963 2963.3931 2983.7872 2996.0415 3043.2264 3053.6287 3101.5984 3108.1378 3124.3151 3134.2548 3147.0178 3156.4848 3167.0330 3557.9054
redmass: 5.5489 4.1522 2.9571 2.7210 2.9084 3.8257 5.1309 3.2987 1.5722 3.4812 3.2353 3.3928 2.8865 5.1654 3.6351 2.5910 5.8812 6.3842 3.8603 2.8157 3.6105 1.8511 2.0018 1.5499 3.1871 1.5783 2.7909 3.4942 4.3212 1.5330 2.6986 1.5010 4.4081 1.6871 1.7371 2.4054 3.3148 3.8451 1.5644 1.9595 2.2113 1.4021 1.0535 1.1546 1.2017 2.6658 1.2201 1.2361 1.2240 1.2588 1.1972 1.2935 1.1975 1.2545 1.5023 8.5599 1.2857 2.1903 1.0833 1.0919 2.2655 1.0823 6.3067 6.0741 1.0710 1.0650 1.0701 1.0819 1.0874 1.0941 1.0948 1.0997 1.0847 1.0882 1.0926 1.0958 1.1008 1.0662
irintensity: 0.6037 0.2853 9.2786 4.5576 0.4384 6.3781 0.8193 1.8524 80.8374 56.8189 24.7193 26.1541 0.0448 2.0781 5.8725 6.6327 15.4132 0.0292 10.1736 19.6649 27.1452 55.0592 24.1061 14.7641 16.3636 25.1878 58.4244 14.0805 60.0821 19.1940 37.2429 0.5973 1.2387 24.7787 11.4476 46.2691 112.0657 20.6087 4.0192 1.1035 9.9839 15.5020 0.0389 15.6061 8.0058 39.4591 1.7418 7.9008 7.2961 44.7699 1.4100 1.0377 6.2345 4.1049 2.2625 0.1928 18.1526 11.7267 5.4654 7.2374 7.1234 5.6341 0.3597 0.1360 65.7905 21.2291 39.8839 51.1175 23.3344 32.4913 19.9840 33.9096 0.1140 6.7398 16.7678 25.1646 16.6570 5.0416
temp: 298.150 k
press: 1.00000 atm
elementType: 8 8 8 6 6 6 6 6 6 6 6 6 6 6 1 1 1 1 1 1 1 1 1 1 1 1 1 1
symmnumber: 1
zpe: 602354.8 jmol-1
zpe.correction: 0.229425 hartree
zpe.thermalcorrener: 0.242494 hartree
zpe.thermalcorrenthalpy: 0.243438 hartree
zpe.thermalcorrgfe: 0.187933 hartree
zpe.sumelectzpe: -652.143704 hartree
zpe.sumelectthermal: -652.130635 hartree
zpe.sumelectthermalent: -652.129691 hartree
zpe.sumelectthermalfe: -652.185196 hartree
dipole: 0.5691 -1.0059 -2.4424
dipole: 2.7020
quadrupole: -73.6779 -88.6039 -81.5527
quadrupole: -9.7168 -4.9144 0.7568
quadrupole: 7.6003 -7.3257 -0.2746 -9.7168 -4.9144 0.7568
hfenergy: -652.3731288 hartree
pointgroup: C01 [X(C11H14O3)]
dipole: -0.200934 0.4676517 -0.9332795 debye
polarizability: 142.7170314|-4.5515642|128.7981336|-9.2785151|-0.6452481|88.9440432 unknown
InChI: InChI=1S/C11H14O3/c12-7-6-10-8-13-11(14-10)9-4-2-1-3-5-9/h1-5,10-12H,6-8H2
charge 0 multiplicity 1
28 atoms
O  -1.198597 0.646253 1.220612
O  -0.043087 2.443858 0.245458
O  -3.92106 -2.200039 -0.605343
C  -1.997602 1.088302 0.029743
C  -1.015099 1.983477 -0.770226
C  0.132926 1.273155 1.116559
C  -2.52001 -0.132291 -0.740386
C  1.184608 0.302208 0.577437
C  -3.468392 -0.99785 0.111011
C  1.02628 -1.096686 0.724741
C  2.361832 0.813367 -0.024326
C  2.033356 -1.977708 0.2684
C  3.36663 -0.068279 -0.481264
C  3.205863 -1.466325 -0.3343
H  -2.837946 1.68763 0.432589
H  -0.500593 1.403425 -1.562679
H  -1.482172 2.883836 -1.195971
H  0.399513 1.667033 2.112702
H  -1.668238 -0.751253 -1.077822
H  -3.054717 0.224954 -1.647233
H  -2.936698 -1.381208 0.995505
H  -4.334169 -0.39258 0.459559
H  0.112738 -1.482858 1.188663
H  2.4743 1.896688 -0.143172
H  1.9018 -3.059606 0.382426
H  4.271866 0.333183 -0.950716
H  3.986545 -2.149836 -0.686911
H  -4.431277 -1.92405 -1.408553
