program: Gaussian 09
title: 000231555
version: EM64L-G09RevD.01
frameworkgroup: C1[X(C10H7NO)]
method: RPBEPBE
basis: SDD
operation: Freq
keyword: #p
keyword: freq=noraman
keyword: PBEPBE/SDD
title: #p freq=noraman PBEPBE/SDD
converged: NO NO NO NO
title: Mulliken charges:
elementType: O N C C C C C C C C C C H H H H H H H
charge: -0.162428 0.020794 0.407961 0.350011 -0.436706 -0.387944 -0.377031 -0.526395 0.098559 -0.223306 -0.228563 -0.155372 0.243542 0.243673 0.244648 0.260102 0.237191 0.237421 0.153844
chargesum: 0.00000
title: Mulliken charges with hydrogens summed into heavy atoms:
elementType: O N C C C C C C C C C C
charge: -0.162428 0.020794 0.407961 0.350011 -0.193165 -0.144271 -0.132383 -0.266293 0.098559 0.013885 0.008858 -0.001528
polarizability: 2.02617789e+02 -2.68691095e+00 1.17312364e+02 -2.98552929e-03 2.29162593e-03 4.48393267e+01
1716.lowfreq: -8.3949 -0.0008 -0.0007 -0.0001 9.3183 22.3639 71.4525 156.3146 175.3019
frequency: 71.3942 156.2946 175.2994 185.6101 295.2715 340.7912 381.1587 393.6204 468.3732 499.7721 512.6614 597.3244 639.8106 674.9318 762.1765 765.0767 783.7604 793.0886 865.4499 875.0509 908.1442 921.5819 946.0159 975.1207 986.4148 1003.7823 1019.2567 1118.6174 1165.1082 1174.8198 1233.1027 1264.3077 1280.8137 1309.3902 1363.4327 1398.2956 1418.7250 1424.9913 1438.9029 1489.6710 1557.8836 1571.8059 1621.4476 1637.2065 2819.2838 3106.6468 3119.9421 3125.6352 3130.6900 3146.9069 3164.8505
redmass: 7.7515 3.0963 7.1942 5.3594 3.0133 6.8629 5.3901 3.0616 2.5168 8.3143 3.4899 7.0429 7.0091 4.4481 5.1809 1.2388 5.8331 2.9685 5.2990 1.3281 1.4626 5.4479 1.5350 1.4916 1.7558 1.3544 2.2909 1.8751 1.4144 1.1054 2.4223 2.5420 1.9695 1.8955 2.7009 1.6510 4.4491 2.1321 2.6079 3.1487 5.9923 6.1743 6.3751 7.9376 1.0837 1.0913 1.0918 1.0864 1.0893 1.0953 1.1004
irintensity: 1.6033 9.2686 4.5502 0.3696 3.0183 1.3710 3.0978 3.9273 17.2103 0.5148 2.4466 4.2063 5.7343 1.8432 25.5658 66.1992 32.9583 0.3092 2.7197 1.5849 34.9107 6.8381 0.3454 0.9022 18.3269 0.0056 2.7389 22.5154 28.9591 4.8603 4.1937 16.3313 8.9647 8.3062 2.9948 6.9561 21.9926 0.0170 5.4873 3.0291 6.7980 6.6282 39.7384 237.9501 130.9023 17.7773 4.7151 3.1334 0.4508 23.0984 26.6466
temp: 298.150 k
press: 1.00000 atm
elementType: 8 7 6 6 6 6 6 6 6 6 6 6 1 1 1 1 1 1 1
symmnumber: 1
zpe: 371319.1 jmol-1
zpe.correction: 0.141428 hartree
zpe.thermalcorrener: 0.150348 hartree
zpe.thermalcorrenthalpy: 0.151292 hartree
zpe.thermalcorrgfe: 0.107047 hartree
zpe.sumelectzpe: -514.409798 hartree
zpe.sumelectthermal: -514.400878 hartree
zpe.sumelectthermalent: -514.399934 hartree
zpe.sumelectthermalfe: -514.444179 hartree
dipole: 6.6522 -2.4257 -0.0011
dipole: 7.0807
quadrupole: -81.0173 -59.2711 -72.0476
quadrupole: 8.2965 0.0065 -0.0005
quadrupole: -10.2386 11.5075 -1.2689 8.2965 0.0065 -0.0005
hfenergy: -514.5512256 hartree
pointgroup: C01 [X(C10H7N1O1)]
dipole: -2.6332538 0.9090743 -0.0004151 debye
dipolederiv: -1.2336797 0.0470957 0.0001995 0.2698424 -0.4097741 -0.0001571 -0.0007535 0.0001599 -0.3063616 -0.3239492 -0.1047249 0.0000081 0.122679 -0.2690296 0.0000172 0.0002358 0.0000153 -0.2227681 0.113363 -0.0399731 0.0000313 -0.1986709 -0.0782232 0.000041 -0.0001099 0.0000252 0.0499149 0.1041087 0.072366 0.000032 0.1319406 -0.2322385 -0.0000202 -0.0000334 0.0000356 0.0855248 0.0931207 0.0210083 -0.0000865 -0.0201498 0.0365531 0.0000261 0.0004926 -0.0000083 -0.1267277 -0.1735274 0.0358628 -0.0000106 -0.0257049 0.1333589 -0.0000059 -0.0000643 -0.0000253 -0.1656422 -0.2034848 -0.0251109 -0.0000024 0.1264465 0.1421335 0.0000034 0.0000193 0.0000331 -0.1465637 0.0731334 -0.0508199 -0.0000512 -0.0473939 0.3969727 -0.0000338 -0.0000128 -0.0000531 -0.0513233 -0.6244931 0.0893879 -0.0000418 -0.259227 0.0337975 -0.0000905 -0.0000612 0.0000497 0.0502459 0.0990005 -0.124256 -0.0000195 -0.0863054 0.0659161 0.000016 -0.0000035 0.0000147 -0.1351916 0.112887 0.1305268 -0.0000121 0.0028122 -0.0375915 -0.0000069 0.0000049 -0.0000147 -0.1473801 1.7913245 -0.0198663 -0.0000744 0.2045267 0.7583564 0.0003411 0.000469 0.0002742 0.1002377 0.0829347 -0.0141604 -0.0000053 -0.0569309 -0.0769036 -0.0000059 0.0000235 -0.000039 0.1559584 0.0741772 -0.0619665 0.000006 0.0048431 -0.080142 -0.0000018 0.0000057 -0.0000026 0.1586937 0.0781506 0.0154815 0.0000023 -0.0559752 -0.0816665 -0.0000052 -0.000004 -0.000001 0.1586966 0.0563083 -0.0729718 -0.0000027 -0.0346432 -0.0914103 0.0000103 -0.0000073 -0.0000056 0.1179805 -0.0474568 0.0978593 0.0000142 0.1036045 0.0199748 -0.00001 0.0000163 0.0000022 0.1601103 -0.0930903 -0.0703123 0.0000118 -0.0687653 0.0669469 0.0000023 0.0000044 -0.000007 0.1611056 0.0211728 0.074574 0.0000013 -0.1129283 -0.2970305 -0.00012 -0.0002216 -0.0004533 0.1034897 unknown
polarizability: 202.6850907|-1.2139924|117.2450626|0.0030246|-0.0022398|44.8393267 unknown
InChI: InChI=1S/C10H7NO/c12-7-10-5-8-3-1-2-4-9(8)6-11-10/h1-7H
charge 0 multiplicity 1
19 atoms
O  4.232785 0.06986 0.000778
N  1.602027 -1.167582 -0.000304
C  -0.632444 0.652142 -0.000182
C  -0.8311 -0.781137 -0.000183
C  0.718196 1.128093 -0.000245
C  -1.775102 1.516913 -0.000082
C  -2.159205 -1.310292 -0.000125
C  0.341545 -1.621759 -0.000197
C  1.782995 0.214917 -0.000363
C  -3.064049 0.974635 -0.000011
C  -3.258747 -0.445002 -0.00004
C  3.179745 0.749135 -0.000671
H  0.919821 2.20701 -0.000232
H  -1.625374 2.603201 -0.000069
H  -2.301578 -2.397714 -0.000147
H  0.216776 -2.71302 -0.000116
H  -3.938193 1.635096 0.000064
H  -4.277987 -0.846822 0.000008
H  3.212487 1.873825 0.000516
