program: Gaussian 09
title: 000231553
version: EM64L-G09RevD.01
frameworkgroup: C1[X(C9H10N2O)]
method: RPBEPBE
basis: SDD
operation: Freq
keyword: #p
keyword: freq=noraman
keyword: PBEPBE/SDD
title: #p freq=noraman PBEPBE/SDD
converged: YES YES YES YES
title: Mulliken charges:
elementType: O N N C C C C C C C C C H H H H H H H H H H
charge: -0.263206 -0.216857 -0.216841 0.273371 0.273351 0.150709 -0.337103 -0.337105 -0.638808 -0.638821 -0.226567 -0.226621 0.236961 0.236967 0.273463 0.233720 0.233728 0.233724 0.273462 0.233727 0.224366 0.224378
chargesum: 0.00000
title: Mulliken charges with hydrogens summed into heavy atoms:
elementType: O N N C C C C C C C C C
charge: -0.263206 -0.216857 -0.216841 0.273371 0.273351 0.150709 -0.100142 -0.100138 0.102103 0.102092 -0.002201 -0.002243
polarizability: 1.58771158e+02 5.02495590e-04 1.22661457e+02 -6.05989296e-03 -9.87657329e-04 5.46193400e+01
1716.lowfreq: -11.1058 -10.5422 0.0005 0.0006 0.0009 4.5282 126.8895 133.5040 138.0980
frequency: 126.8859 133.5029 138.0967 157.2616 163.0178 224.2710 251.3050 284.8314 324.5059 332.7895 438.7514 489.4197 551.4408 571.4558 575.5094 641.5217 700.7935 700.8752 744.4571 744.7603 825.2079 845.7571 910.0927 915.1613 963.6169 1014.1079 1018.8058 1062.6144 1124.8745 1128.3197 1131.0198 1135.9365 1171.9094 1232.5904 1261.5895 1311.3913 1356.8439 1376.3560 1419.3419 1429.4625 1437.8505 1464.5209 1480.0219 1480.6154 1486.7854 1490.2624 1507.5689 1612.0244 1631.1768 1668.2847 2979.4089 2980.1634 3061.4991 3061.6257 3106.0570 3106.4327 3133.5355 3145.4202 3157.4119 3170.5620
redmass: 2.8951 4.0212 2.8393 1.0563 1.1810 3.0939 2.6395 5.1623 6.6854 5.1821 3.2887 7.2355 5.2636 5.3658 3.8681 4.9222 6.1467 7.6527 1.2913 4.5454 4.2741 1.4074 3.0748 1.3830 1.2945 2.0380 6.2695 2.9725 1.4228 1.3060 1.2981 2.0011 1.1056 1.8072 3.9289 1.6423 3.6397 5.0770 3.4506 1.3119 1.3601 2.2254 1.0431 1.0426 1.0757 1.1499 4.6447 7.3635 7.8352 10.1751 1.0344 1.0345 1.1023 1.1023 1.0991 1.0990 1.0851 1.0897 1.0952 1.1003
irintensity: 12.7502 0.1323 0.0000 0.0001 0.7439 0.8337 1.6467 0.0000 11.4540 0.3299 6.2615 1.4440 16.3825 20.9011 0.0000 0.5367 4.3858 0.3785 122.5990 0.0298 4.0076 0.0000 5.3325 5.1779 0.0000 18.3165 1.6033 41.3930 27.2215 0.0000 0.4415 25.2077 0.8214 18.5094 31.4993 5.6188 9.4936 95.9987 27.5668 3.7243 42.1043 17.2880 0.0005 35.9660 37.0945 0.9548 154.0790 59.6113 25.6886 535.3218 109.7726 3.4523 10.9814 49.9083 0.1615 1.6780 0.0394 12.3838 25.1284 14.7881
temp: 298.150 k
press: 1.00000 atm
elementType: 8 7 7 6 6 6 6 6 6 6 6 6 1 1 1 1 1 1 1 1 1 1
symmnumber: 1
zpe: 461110.6 jmol-1
zpe.correction: 0.175628 hartree
zpe.thermalcorrener: 0.186155 hartree
zpe.thermalcorrenthalpy: 0.187100 hartree
zpe.thermalcorrgfe: 0.139983 hartree
zpe.sumelectzpe: -532.853144 hartree
zpe.sumelectthermal: -532.842616 hartree
zpe.sumelectthermalent: -532.841672 hartree
zpe.sumelectthermalfe: -532.888789 hartree
dipole: -2.5491 -0.0001 0.0002
dipole: 2.5491
quadrupole: -79.5594 -54.3868 -73.6829
quadrupole: -0.0016 0.0004 -0.0004
quadrupole: -10.3497 14.8229 -4.4732 -0.0016 0.0004 -0.0004
hfenergy: -533.0287719 hartree
pointgroup: C01 [X(C9H10N2O1)]
dipole: -1.0028666 -0.0058884 -0.0000838 debye
dipolederiv: -1.6587401 -0.0067287 -0.0000954 -0.0066841 -0.5089565 0.0000034 -0.0000616 -0.0000019 -0.3835351 -1.133948 -0.0185684 -0.0000492 0.1959633 -0.8006222 0.0000405 -0.000089 -0.0000503 -0.1779406 -1.1317963 0.0146377 -0.0000492 -0.1998237 -0.8027825 -0.0000104 -0.0000571 -0.000015 -0.1779286 0.7252235 0.2830235 0.00004 0.6086336 -0.0984353 0.0000434 0.0000526 0.0000456 0.0529522 0.7354428 -0.2732955 0.0000279 -0.5989031 -0.1087559 -0.0000243 0.0000405 -0.0000059 0.052937 2.1002763 0.0057316 0.0001327 0.0056523 1.1251187 0.0000049 0.0001106 0.0000173 0.2144661 0.0315558 -0.105216 0.0000161 0.0520437 0.0675573 -0.0000085 0.0000109 -0.0000153 -0.1957252 0.0309408 0.1047784 0.0000146 -0.0525385 0.0681619 0.0000007 0.0000173 0.0000098 -0.1957193 0.0673554 0.1571285 -0.0000418 0.1712314 0.5602056 -0.0000463 -0.0000471 -0.0000254 0.2511118 0.0712454 -0.1627574 -0.0000197 -0.1768965 0.5563443 -0.0000121 -0.0000265 -0.0000044 0.2511035 -0.0789311 0.028904 0.0000061 -0.1873933 0.0061933 -0.0000107 0.0000071 -0.0000002 -0.1845533 -0.0807821 -0.0299455 0.0000086 0.1863724 0.0080402 0.0000111 0.0000076 -0.0000035 -0.1845544 0.0965232 -0.0261131 -0.0000044 -0.0016237 -0.0948046 0.0000054 -0.0000058 0.0000021 0.1717396 0.0961816 0.0283967 -0.0000045 0.0038863 -0.0944509 -0.0000009 -0.0000057 -0.0000013 0.1717354 -0.0344516 -0.0760019 -0.0000494 0.0539869 0.1366589 0.0000251 -0.0000387 0.0000084 0.1315905 0.0925589 0.0661383 0.0905309 -0.0288539 -0.0565101 -0.0599945 0.0361804 -0.1168676 -0.0655977 0.0926079 0.066027 -0.0904556 -0.0289138 -0.0565092 0.0599866 -0.0360859 0.1169238 -0.0657281 0.0929706 -0.0643837 0.089827 0.0306041 -0.056911 0.0610371 0.0348062 0.1172817 -0.0656453 -0.0346939 0.0740053 -0.0000271 -0.0559586 0.1368687 -0.0000102 -0.00002 0.0000026 0.1315944 0.0930029 -0.0643444 -0.089775 0.0306211 -0.0569264 -0.0610409 -0.034763 -0.1173037 -0.065679 -0.0873529 0.0872612 -0.0000164 0.0939115 0.0363189 0.0000066 -0.0000161 0.0000078 0.1666844 -0.085189 -0.0886778 -0.000016 -0.0953173 0.0341968 -0.0000058 -0.0000166 -0.0000046 0.1666917 unknown
polarizability: 158.7699099|0.2122699|122.6627045|0.0060656|-0.0009519|54.61934 unknown
InChI: InChI=1S/C9H10N2O/c1-10-7-5-3-4-6-8(7)11(2)9(10)12/h3-6H,1-2H3
charge 0 multiplicity 1
22 atoms
O  3.042264 0.01893 0.000071
N  0.912987 1.134492 -0.000047
N  0.92612 -1.12133 -0.000076
C  -0.428483 0.713991 -0.000148
C  -0.420137 -0.716465 -0.000142
C  1.780511 0.011584 0.000004
C  -1.633888 1.435942 -0.000231
C  -1.616944 -1.452566 -0.000221
C  1.402101 2.508931 -0.000125
C  1.431098 -2.490033 0.000014
C  -2.842874 0.693051 -0.000304
C  -2.834592 -0.723976 -0.000298
H  -1.645796 2.530569 -0.000247
H  -1.615858 -2.547252 -0.000228
H  2.503607 2.471238 0.000184
H  1.060155 3.052286 0.899801
H  1.060654 3.052032 -0.900398
H  1.095547 -3.037185 0.90006
H  2.532093 -2.439647 0.000168
H  1.095815 -3.03722 -0.900111
H  -3.799038 1.227129 -0.000368
H  -3.784438 -1.269206 -0.000359
