program: Gaussian 09
title: 000231548
version: EM64L-G09RevD.01
frameworkgroup: C1[X(C8H9NO2)]
method: RPBEPBE
basis: SDD
operation: Freq
keyword: #pfreq=noraman
keyword: PBEPBE/SDD
title: #p freq=noraman PBEPBE/SDD
converged: NO YES NO YES
title: Mulliken charges:
elementType: O O N C C C C C C C C H H H H H H H H H
charge: -0.281300 -0.254295 -0.031162 0.254011 0.171888 -0.260993 -0.284684 -0.461899 -0.770528 0.180718 -0.501005 0.276780 0.241098 0.279566 0.258039 0.231276 0.231236 0.243194 0.243200 0.234859
chargesum: 0.00000
title: Mulliken charges with hydrogens summed into heavy atoms:
elementType: O O N C C C C C C C C
charge: -0.281300 -0.254295 -0.031162 0.254011 0.171888 0.015787 -0.043585 -0.182333 -0.049977 0.180718 0.220248
polarizability: 1.53787428e+02 1.77655012e+00 9.74942810e+01 1.03258725e-03 1.70447768e-03 5.01646555e+01
1716.lowfreq: -39.5317 -6.8245 -0.0003 0.0003 0.0006 4.1361 13.2469 58.4008 80.2716
frequency: -39.1468 58.3959 80.2402 111.5564 133.7991 153.4112 280.3603 285.5382 321.7800 350.8408 401.5508 463.1853 475.6461 611.7379 631.4116 697.2823 748.7355 752.2386 811.3804 861.2343 920.1523 952.4195 976.2437 1001.2329 1003.4149 1048.8101 1077.5059 1114.9578 1131.0624 1151.3035 1245.2969 1257.1358 1291.4586 1315.9298 1362.2535 1389.9390 1425.2567 1451.1900 1453.7005 1464.0729 1467.7105 1476.9792 1549.1952 1592.4154 1623.6677 2983.6659 3002.9236 3060.8358 3103.5704 3120.3583 3142.7307 3148.2895 3161.4051 3166.3942
redmass: 1.0303 4.8790 3.0988 1.1989 3.9559 3.3320 4.2391 4.7980 4.6274 3.5788 3.2508 5.7230 2.9731 5.8302 7.6359 6.3649 5.5249 2.9673 5.6558 1.4392 8.5578 1.4655 1.5302 3.5394 1.3499 1.6186 4.4697 1.2641 1.3075 1.4638 3.5579 2.8990 1.5305 8.1252 2.4493 1.2601 1.1947 1.2664 1.0493 1.0513 1.0465 2.0820 5.6586 6.2435 10.1355 1.0384 1.0299 1.0969 1.1044 1.0982 1.0892 1.1045 1.0929 1.0973
irintensity: 0.4488 4.9147 0.3077 0.3315 2.1856 2.8606 12.1309 8.3456 4.2711 10.9758 6.6565 3.9551 3.1008 0.7432 1.3094 15.2467 6.4160 16.1049 2.1882 21.7835 3.0149 3.0083 6.7724 20.3976 1.2042 11.8185 197.6427 0.0362 45.3256 35.2304 31.8053 229.0473 35.3910 3.1484 29.4212 25.5999 38.3177 19.9076 14.6512 11.3114 16.4252 24.1749 2.2275 93.3461 230.4878 14.0659 37.3665 17.0999 26.5404 8.8367 7.3915 15.0720 8.0895 2.9687
temp: 298.150 k
press: 1.00000 atm
elementType: 8 8 7 6 6 6 6 6 6 6 6 1 1 1 1 1 1 1 1 1
symmnumber: 1
zpe: 405915.7 jmol-1
zpe.correction: 0.154605 hartree
zpe.thermalcorrener: 0.164671 hartree
zpe.thermalcorrenthalpy: 0.165615 hartree
zpe.thermalcorrgfe: 0.118393 hartree
zpe.sumelectzpe: -514.642870 hartree
zpe.sumelectthermal: -514.632804 hartree
zpe.sumelectthermalent: -514.631860 hartree
zpe.sumelectthermalfe: -514.679082 hartree
dipole: 0.2498 0.3396 0.0000
dipole: 0.4216
quadrupole: -49.5178 -67.9558 -65.1227
quadrupole: 11.8865 -0.0008 -0.0003
quadrupole: 11.3476 -7.0904 -4.2572 11.8865 -0.0008 -0.0003
hfenergy: -514.7974749 hartree
pointgroup: C01 [X(C8H9N1O2)]
dipole: 0.0961431 0.1351731 -0.0000004 debye
dipolederiv: -1.267288 -0.3684094 0.0001159 -0.7171995 -0.8476134 0.0000272 0.0003162 0.0001783 -0.294353 -0.8632751 0.2599819 -0.0000734 0.1128724 -0.8571614 0.0001514 0.0000895 -0.0001862 -0.3271024 -0.7252377 -0.028728 -0.0000251 -0.1968031 -0.3121664 -0.0000036 -0.0000283 -0.0000009 -0.2499986 -0.7461746 0.064141 0.0000209 -0.0554374 -0.2372596 -0.0000113 -0.0001368 -0.0000073 0.0228527 0.8894752 -0.0316898 0.000006 -0.1331816 0.1972591 -0.0000022 -0.0001881 0.0000446 0.0356099 0.2853272 -0.0690143 0.0000311 0.1718 0.1057251 0.0000193 -0.0000087 0.0000098 -0.0843125 -0.4304016 0.1726397 -0.0000172 0.4159415 -0.0700537 0.0000168 0.0000402 -0.0000208 -0.1378805 0.3327158 0.0024815 0.000036 -0.0272791 0.2526346 0.0000097 -0.0000192 0.0000199 -0.0312771 -0.3887248 0.0279495 0.0000298 -0.0850501 0.0495296 0.0000467 0.0004665 -0.0000021 0.0476959 1.9541265 0.0144488 0.0000001 0.4697787 1.3522558 -0.0001744 -0.0000632 0.0000181 0.2445202 0.7292899 0.1599056 -0.0000829 0.1014076 0.2549665 -0.0000012 -0.0001171 -0.0000456 0.2822669 0.1099403 0.0724004 -0.0000076 0.0402827 0.0155261 0.0000006 -0.0000195 0.0000027 0.1460398 0.0047551 -0.0959242 -0.0000194 -0.1065301 -0.021867 -0.000016 -0.0000241 -0.0000247 0.1546542 0.0609599 -0.0610485 -0.0000173 -0.095741 0.0263075 -0.0000119 -0.0000137 -0.0000136 0.1298767 0.0918388 -0.0001183 -0.0000124 0.1018847 -0.0736066 0.0002001 -0.0001739 0.0001715 0.1201552 0.0086807 -0.0064795 0.0521009 -0.0078354 0.0635781 0.0982137 0.1029634 0.0744451 -0.0352402 0.008728 -0.0065632 -0.052073 -0.0080321 0.0631849 -0.0984619 -0.1030809 -0.0746206 -0.0349176 -0.0438517 -0.0316971 -0.0250444 0.0653481 0.0649882 0.0985477 -0.0703507 0.063855 -0.0555864 -0.0437858 -0.0317305 0.0250123 0.0653086 0.0649339 -0.0986033 0.0703082 -0.0638712 -0.0555723 0.0329019 -0.0425456 0.0000195 -0.1115348 -0.0911615 0.0000528 0.00004 0.0000481 0.1225691 unknown
polarizability: 153.7164212|2.6736283|97.5652879|0.0010053|0.0017207|50.1646555 unknown
InChI: InChI=1S/C8H9NO2/c1-6-3-4-7(5-9-6)8(10)11-2/h3-5H,1-2H3
charge 0 multiplicity 1
20 atoms
O  -2.449898 -0.89679 -0.000611
O  -2.38764 1.434799 -0.000526
N  1.685016 -1.262043 -0.000558
C  -0.304592 0.165942 -0.000756
C  2.474143 -0.137882 -0.000421
C  0.515433 1.324492 -0.000593
C  1.912459 1.170166 -0.000434
C  0.331405 -1.101501 -0.000718
C  3.971257 -0.353625 -0.000317
C  -1.78378 0.333432 -0.000948
C  -3.928197 -0.817622 -0.000236
H  0.042249 2.311799 -0.000605
H  2.571668 2.044392 -0.000314
H  -0.267821 -2.016942 -0.000835
H  4.188509 -1.432469 0.000624
H  4.441271 0.104906 -0.890578
H  4.441448 0.106596 0.888967
H  -4.283613 -0.285008 -0.898685
H  -4.283151 -0.284725 0.898228
H  -4.266166 -1.863318 0.000017
