program: Gaussian 09
title: 000231545
version: EM64L-G09RevD.01
frameworkgroup: C1[X(C6H15NO)]
method: RPBEPBE
basis: SDD
operation: Freq
keyword: #p
keyword: freq=noraman
keyword: PBEPBE/SDD
title: #p freq=noraman PBEPBE/SDD
converged: NO YES NO NO
title: Mulliken charges:
elementType: O N C C C C C C H H H H H H H H H H H H H H H
charge: -0.443633 -0.581027 0.000157 -0.427278 -0.394446 -0.436331 -0.339861 -0.707545 0.181832 0.218843 0.219058 0.199270 0.191028 0.201195 0.189388 0.191077 0.220020 0.209481 0.214827 0.228395 0.276799 0.259694 0.329057
chargesum: 0.00000
title: Mulliken charges with hydrogens summed into heavy atoms:
elementType: O N C C C C C C
charge: -0.114577 -0.044534 0.181989 0.010623 -0.004147 -0.045747 0.071236 -0.054842
polarizability: 7.68172169e+01 -6.48675308e-01 8.29634881e+01 1.31083211e+00 -1.50896149e+00 6.70292500e+01
1716.lowfreq: -20.8370 -14.1029 -8.4233 0.0006 0.0011 0.0011 43.0645 63.0790 94.6632
frequency: 42.9564 62.9109 94.4856 147.2135 186.5771 196.2422 226.7434 240.3032 293.3903 325.6826 362.0288 398.3096 477.2164 541.3599 629.2764 760.6163 786.3341 817.0427 919.4087 921.6288 943.2633 991.1346 1019.3430 1034.8062 1041.4047 1087.6588 1101.0498 1143.4530 1171.6156 1187.8369 1239.7108 1265.5706 1281.3719 1299.3638 1300.0599 1336.8759 1351.0795 1361.3370 1374.1192 1381.4373 1390.0019 1455.7517 1474.0609 1475.9634 1480.0738 1487.2436 1490.8510 1637.4172 2875.0777 2928.0516 2958.3591 2964.9332 2976.5203 2982.3466 3009.1887 3019.9656 3039.7860 3069.2009 3074.1902 3077.1852 3451.2835 3552.2774 3577.6798
redmass: 2.5915 2.7689 2.3373 1.6097 2.0589 2.3404 1.2590 1.3873 2.3486 1.2561 2.6226 3.5508 2.2391 2.4832 1.2762 1.2070 1.4094 1.8745 1.9515 1.6086 2.6334 2.3073 1.7046 1.5911 1.9809 2.0235 1.8933 1.7497 1.8484 1.6516 1.3003 1.1884 1.2262 1.1407 1.2706 1.3980 1.4387 1.3344 1.4168 1.2749 1.2190 1.0840 1.0621 1.0761 1.0529 1.0851 1.0722 1.0934 1.0717 1.0815 1.0675 1.0604 1.0372 1.0617 1.0972 1.0915 1.0965 1.0995 1.0979 1.0994 1.0451 1.0659 1.0971
irintensity: 2.1816 2.0161 1.2060 0.9415 4.4001 0.8628 20.5250 1.4093 11.2537 116.5264 50.8988 9.0889 13.0367 1.1305 198.5435 11.4986 9.3969 9.0401 3.3019 0.2897 66.4624 26.9664 20.2024 16.8687 1.3855 15.6277 24.0875 1.1307 7.6188 7.2662 1.8648 2.5919 6.1883 5.3469 1.9953 2.6970 0.5902 2.6860 8.8881 21.9796 12.0321 9.2719 2.1335 7.3002 12.4263 11.3380 4.8494 42.8132 107.1309 31.9435 28.7813 70.7210 25.4072 42.0659 8.4709 74.8877 23.1560 49.7959 71.6126 37.9513 1.0855 5.1040 0.5760
temp: 298.150 k
press: 1.00000 atm
elementType: 8 7 6 6 6 6 6 6 1 1 1 1 1 1 1 1 1 1 1 1 1 1 1
symmnumber: 1
zpe: 543042.6 jmol-1
zpe.correction: 0.206834 hartree
zpe.thermalcorrener: 0.217730 hartree
zpe.thermalcorrenthalpy: 0.218674 hartree
zpe.thermalcorrgfe: 0.170264 hartree
zpe.sumelectzpe: -366.893996 hartree
zpe.sumelectthermal: -366.883100 hartree
zpe.sumelectthermalent: -366.882156 hartree
zpe.sumelectthermalfe: -366.930565 hartree
dipole: -3.3666 -1.1943 0.1769
dipole: 3.5765
quadrupole: -58.3933 -47.1338 -50.4358
quadrupole: 0.7059 0.7981 -0.3957
quadrupole: -6.4057 4.8538 1.5519 0.7059 0.7981 -0.3957
hfenergy: -367.1008297 hartree
pointgroup: C01 [X(C6H15N1O1)]
dipole: 1.0264175 0.9557122 0.1142524 debye
dipolederiv: -0.9404928 -0.0807983 -0.0296993 -0.0358085 -0.2138299 0.1672099 -0.0143117 0.1662889 -0.4870917 -0.6295551 0.0403246 0.1917808 0.0261327 -0.6090978 -0.1093823 0.2109982 -0.1111335 -0.2970703 0.1324846 0.0061281 0.0686585 0.0364791 0.0100948 0.0016265 0.0213135 0.0545051 0.1163521 -0.1231451 -0.0156025 0.0016485 -0.1109696 0.0013846 -0.0137077 -0.0425605 -0.044733 -0.0169159 0.1260065 -0.0026613 0.0407878 0.0025253 0.0193758 0.0087229 0.0342387 0.0312507 0.1062207 0.3528154 -0.0078928 -0.0527066 -0.0990821 0.4538248 0.1747686 -0.0743016 0.1204022 0.2364311 0.6715714 0.0382283 -0.0657366 0.0105133 0.2996365 -0.0615385 -0.0352577 -0.0517085 0.3322397 0.080513 0.0167192 0.0095601 0.014349 -0.0654902 0.0428668 0.0131075 0.0219432 0.0603014 -0.0681375 -0.0333842 -0.114845 -0.0214456 0.0283001 -0.0275875 -0.1126115 -0.0334779 -0.1530797 0.0521971 -0.0427245 -0.0077984 -0.0464323 -0.0722699 0.1349556 -0.0325706 0.1170433 -0.0443834 -0.0091898 0.1082726 0.046307 0.140109 0.0212228 -0.1058928 0.0044499 -0.0844155 0.0166641 0.033692 0.0028534 -0.1264724 0.0203978 0.019813 0.0037563 -0.092693 -0.0072637 -0.1446532 -0.1914406 -0.0600248 0.0755409 -0.0863651 0.0142829 0.0314596 0.0566104 0.0178999 0.0526124 0.0172797 0.0401078 -0.1239803 0.0234017 0.045088 -0.0359571 -0.0878068 -0.029499 -0.1220282 -0.2876174 0.0079366 0.1495151 -0.0016956 -0.0344177 -0.0269275 0.0985651 -0.0269675 -0.0018617 -0.0194101 -0.0146944 0.0322942 -0.0389452 -0.0809128 0.1634681 0.0409676 0.1310384 -0.1012722 0.0259691 0.038108 0.0482685 0.0543748 -0.0911582 -0.0986639 0.0523784 -0.0749754 0.014266 0.0393724 -0.0017991 -0.097154 -0.0315916 0.0675983 -0.0404779 -0.1116939 0.0260252 -0.13304 0.0118859 0.1263713 0.0643567 0.1086498 -0.0912902 -0.0733714 0.0852729 -0.107205 0.0187162 -0.1246409 -0.112013 0.0350414 -0.0771343 0.0613483 0.0244365 0.0256674 0.0319302 0.0693868 0.3272228 -0.0608787 -0.0038891 0.0355454 -0.0143099 0.0419061 -0.0143841 0.0704943 0.1199111 0.1797093 0.0108116 -0.1735422 0.0481915 0.1756346 -0.0405948 -0.1113625 -0.0708574 0.101853 0.3429101 -0.0033879 0.0320646 0.0288005 0.0551719 -0.1610755 0.0859845 -0.1465851 0.2564418 unknown
polarizability: 78.3030121|-2.6348698|81.4306902|-1.7944139|1.3619784|67.0762527 unknown
InChI: InChI=1S/C6H15NO/c1-2-6(5-7)3-4-8/h6,8H,2-5,7H2,1H3
charge 0 multiplicity 1
23 atoms
O  -2.956534 -0.706533 -0.102311
N  0.418608 2.68474 0.380109
C  0.817573 0.208439 0.312333
C  -0.660152 -0.109152 0.67228
C  1.525063 -0.913916 -0.495479
C  0.958388 1.568727 -0.425624
C  -1.564928 -0.453334 -0.525253
C  1.553492 -2.282956 0.218703
H  1.363341 0.306135 1.278792
H  -0.705557 -0.947915 1.392363
H  -1.068802 0.789605 1.17718
H  1.039635 -1.023288 -1.486869
H  2.567339 -0.593051 -0.700481
H  0.392147 1.534329 -1.376474
H  2.033601 1.696881 -0.702915
H  -1.538511 0.355458 -1.285937
H  -1.261355 -1.39679 -1.008669
H  2.0358 -2.200792 1.211298
H  2.120839 -3.025676 -0.371623
H  0.536372 -2.685723 0.373482
H  0.273842 3.553553 -0.142775
H  0.93709 2.849926 1.249629
H  -3.267593 0.078035 0.417743
