program: Gaussian 09
title: 000231554
version: EM64L-G09RevD.01
frameworkgroup: C1[X(C9H19Br)]
method: RPBEPBE
basis: SDD
operation: Freq
keyword: #pfreq=noraman
keyword: PBEPBE/SDD
title: #p freq=noraman PBEPBE/SDD
converged: YES YES NO NO
title: Mulliken charges:
elementType: Br C C C C C C C C C H H H H H H H H H H H H H H H H H H H
charge: -0.054158 0.009842 -0.414757 -0.060481 -0.439384 -0.768855 -0.326694 -0.702637 -0.708148 -0.689902 0.196177 0.202395 0.190263 0.194733 0.201887 0.198758 0.210978 0.218628 0.240694 0.243795 0.238194 0.213524 0.205839 0.212097 0.211934 0.210768 0.212910 0.275841 0.275761
chargesum: 0.00000
title: Mulliken charges with hydrogens summed into heavy atoms:
elementType: Br C C C C C C C C C
charge: -0.054158 0.206018 -0.022099 0.134252 -0.038739 -0.098555 0.155295 -0.071178 -0.072536 -0.138300
polarizability: 1.47403365e+02 6.09840653e-01 9.57133427e+01 -9.14490396e+00 -1.83803528e+00 9.70150726e+01
1716.lowfreq: -20.6702 -2.0881 -0.0002 0.0005 0.0005 5.6302 26.9648 37.2017 68.3744
frequency: 23.6654 36.9911 68.0222 90.3948 103.2549 140.6090 186.2496 201.4972 224.6580 249.2125 265.9017 277.1444 308.8941 352.6450 372.5297 403.7205 495.5992 564.4505 628.1699 749.8078 770.3826 818.7886 826.5952 862.3441 913.2539 930.8805 956.1844 960.8080 967.8740 988.1055 1031.9644 1042.1112 1065.9443 1085.3348 1120.4645 1170.2168 1174.6792 1191.7173 1214.2906 1250.3807 1254.8199 1264.6801 1288.5821 1299.4666 1320.8402 1322.8778 1345.1821 1352.2826 1361.5031 1376.4612 1389.3239 1394.5156 1450.2813 1458.6135 1464.3078 1467.3772 1473.1687 1475.8259 1483.0967 1484.6863 1488.3681 1494.5255 2947.4682 2952.3170 2964.8650 2966.5331 2971.5918 2973.1383 2975.6914 3006.3094 3008.3376 3013.6227 3046.5545 3058.4923 3063.8290 3064.3291 3066.3378 3069.1613 3069.3074 3083.0870 3132.0865
redmass: 2.9888 4.3491 2.0870 4.3262 2.3629 2.3538 2.7673 1.3837 1.1297 1.8469 1.3460 2.2444 2.7462 2.1455 2.0644 1.6983 2.5173 3.4399 3.7579 1.1413 2.3320 1.4847 2.2071 1.5415 1.2066 1.9967 1.5586 1.9189 1.5528 1.6912 1.6814 1.5193 2.5867 1.4994 1.7853 1.9723 1.7611 1.9413 1.2353 1.1601 1.3706 1.2518 1.2481 1.2511 1.3902 1.4147 1.4516 1.3970 1.3486 1.2257 1.2205 1.2172 1.1038 1.0681 1.0508 1.0729 1.0532 1.0524 1.0860 1.0571 1.0546 1.0538 1.0689 1.0648 1.0654 1.0358 1.0414 1.0762 1.0396 1.0927 1.0686 1.1009 1.0565 1.0995 1.0996 1.0998 1.0988 1.1023 1.0993 1.0976 1.1112
irintensity: 0.1446 0.6147 0.7192 0.4874 0.0968 0.3517 0.0416 0.3525 0.0749 0.4148 0.8975 4.6649 0.2787 0.8205 0.2095 0.2655 6.3709 7.4374 42.5584 8.5037 1.6525 0.1503 1.3417 3.3624 1.6703 3.0185 0.2928 0.0720 3.7858 6.2284 3.0582 2.1780 6.3085 1.8852 1.7751 7.8862 3.0020 8.1551 10.5128 0.4623 20.0942 13.4515 29.6457 17.6150 4.7461 2.9224 0.8073 6.6741 2.7187 17.4187 23.5034 17.9728 2.0587 1.8200 4.0002 6.6399 5.2372 7.2842 16.0235 13.4922 9.8757 10.7724 8.1050 31.4515 41.1368 40.8415 15.8385 68.5152 18.9520 5.7882 21.3330 51.9327 24.1917 7.7780 29.0284 34.3609 122.0796 24.5846 72.1288 31.7427 18.7501
temp: 298.150 k
press: 1.00000 atm
elementType: 35 6 6 6 6 6 6 6 6 6 1 1 1 1 1 1 1 1 1 1 1 1 1 1 1 1 1 1 1
symmnumber: 1
zpe: 683244.6 jmol-1
zpe.correction: 0.260234 hartree
zpe.thermalcorrener: 0.273844 hartree
zpe.thermalcorrenthalpy: 0.274788 hartree
zpe.thermalcorrgfe: 0.217794 hartree
zpe.sumelectzpe: -366.965452 hartree
zpe.sumelectthermal: -366.951842 hartree
zpe.sumelectthermalent: -366.950898 hartree
zpe.sumelectthermalfe: -367.007892 hartree
dipole: -2.8012 -0.0694 1.2036
dipole: 3.0496
quadrupole: -85.2978 -74.9206 -73.3914
quadrupole: 0.7948 2.8556 0.1635
quadrupole: -7.4279 2.9493 4.4786 0.7948 2.8556 0.1635
hfenergy: -367.2256865 hartree
pointgroup: C01 [X(C9H19Br1)]
dipole: 1.0866147 0.389868 0.3268612 debye
polarizability: 146.2680437|6.407903|97.5893418|10.1628617|0.0708663|96.2743943 unknown
InChI: InChI=1S/C9H19Br/c1-8(2)7-9(3)5-4-6-10/h8-9H,4-7H2,1-3H3
charge 0 multiplicity 1
29 atoms
Br -4.814364 -0.063994 -1.04177
C  0.461031 0.166687 0.75439
C  1.034692 -0.485066 -0.544767
C  2.579791 -0.400509 -0.738146
C  -0.837292 0.981595 0.47124
C  0.239192 -0.872276 1.882659
C  -2.031277 0.128483 -0.038965
C  3.052732 1.055372 -0.975897
C  3.380152 -1.056382 0.413135
C  -3.21613 1.027131 -0.392079
H  1.203015 0.905413 1.12426
H  0.730225 -1.551153 -0.580578
H  0.570253 -0.002026 -1.429697
H  2.804672 -0.973239 -1.663639
H  -0.603907 1.764971 -0.279777
H  -1.142328 1.509399 1.399026
H  -0.165929 -0.393592 2.794775
H  -0.471292 -1.659356 1.568487
H  1.184387 -1.373235 2.154516
H  -1.730339 -0.452422 -0.930153
H  -2.339134 -0.596875 0.735269
H  4.138329 1.087474 -1.185188
H  2.868859 1.691262 -0.088932
H  2.526493 1.512062 -1.835292
H  3.247768 -0.503621 1.362321
H  4.461816 -1.060759 0.181552
H  3.063877 -2.10308 0.580703
H  -2.998579 1.714535 -1.22471
H  -3.602312 1.586601 0.474553
