program: Gaussian 09
title: 000231544
version: EM64L-G09RevD.01
frameworkgroup: C1[X(C6H12Br2)]
method: RPBEPBE
basis: SDD
operation: Freq
keyword: #pfreq=noraman
keyword: PBEPBE/SDD
title: #p freq=noraman PBEPBE/SDD
converged: YES YES NO NO
title: Mulliken charges:
elementType: Br Br C C C C C C H H H H H H H H H H H H
charge: -0.040852 -0.037246 0.005397 -0.390162 -0.321497 -0.717104 -0.699740 -0.698018 0.236201 0.203758 0.198902 0.242470 0.228984 0.281878 0.274693 0.228738 0.242219 0.204444 0.278376 0.278559
chargesum: 0.00000
title: Mulliken charges with hydrogens summed into heavy atoms:
elementType: Br Br C C C C C C
charge: -0.040852 -0.037246 0.241599 0.012498 0.149956 -0.160533 -0.024339 -0.141083
polarizability: 1.49985869e+02 2.48527253e+00 7.33938563e+01 1.88317320e+00 -5.35280857e+00 6.72467109e+01
1716.lowfreq: -15.6154 -0.0003 -0.0003 0.0003 3.8976 8.6794 30.6815 59.5266 68.5271
frequency: 30.4408 59.1565 68.4797 98.6876 125.3932 149.1857 178.6569 227.1990 284.2748 340.6762 407.5721 447.6813 599.7862 638.7733 748.6226 806.8767 823.4929 871.6652 929.4227 964.6026 1023.1720 1040.1914 1053.3462 1073.7155 1115.3859 1157.2072 1201.8943 1217.0163 1234.2920 1261.9349 1283.5966 1292.7139 1316.5829 1337.1751 1351.8909 1389.6474 1438.6665 1450.5213 1463.4081 1475.3787 1480.8500 1487.5776 2957.5698 2979.2734 2989.4158 3005.0343 3015.8766 3039.0300 3046.9494 3070.8389 3076.2325 3091.4865 3124.9579 3132.2120
redmass: 5.2194 2.9882 3.4922 2.7116 2.0378 11.9146 3.8482 1.1760 2.8882 3.6614 2.0416 2.7208 6.0529 4.1520 1.0985 1.4541 1.7661 1.5136 1.9569 1.3381 3.7909 1.2130 3.2484 1.1744 2.4488 1.7315 1.5350 1.1881 1.1720 1.3039 1.2093 1.0912 1.2921 1.4328 1.4188 1.2145 1.0974 1.1023 1.0751 1.0586 1.0936 1.0462 1.0581 1.0406 1.0827 1.0627 1.0975 1.0566 1.0564 1.1028 1.0972 1.0991 1.1106 1.1111
irintensity: 1.9550 0.3741 1.0801 0.3188 0.6251 0.6004 4.5735 0.3274 0.6541 9.6585 3.2153 1.0939 5.3514 62.1625 10.0061 6.3705 6.0684 4.7671 19.9368 0.7156 0.6698 6.1731 12.9878 1.2139 3.6095 2.9775 1.1352 4.7121 23.5898 2.7960 69.0436 0.7392 4.9952 1.9431 0.5487 24.1807 6.4409 2.3180 0.9669 4.9753 11.9897 19.3276 29.1854 18.7956 4.9363 13.7469 30.3303 19.6464 24.1245 26.4738 34.8733 25.4155 12.8702 18.7842
temp: 298.150 k
press: 1.00000 atm
elementType: 35 35 6 6 6 6 6 6 1 1 1 1 1 1 1 1 1 1 1 1
symmnumber: 1
zpe: 439482.2 jmol-1
zpe.correction: 0.167390 hartree
zpe.thermalcorrener: 0.178289 hartree
zpe.thermalcorrenthalpy: 0.179233 hartree
zpe.thermalcorrgfe: 0.127133 hartree
zpe.sumelectzpe: -262.093170 hartree
zpe.sumelectthermal: -262.082271 hartree
zpe.sumelectthermalent: -262.081327 hartree
zpe.sumelectthermalfe: -262.133427 hartree
dipole: -0.0235 -1.2212 1.4359
dipole: 1.8851
quadrupole: -95.9267 -67.6367 -68.4305
quadrupole: -1.2713 -0.2995 -1.0104
quadrupole: -18.5954 9.6946 8.9008 -1.2713 -0.2995 -1.0104
hfenergy: -262.26056 hartree
pointgroup: C01 [X(C6H12Br2)]
dipole: 0.0009195 -0.5050964 0.5430946 debye
dipolederiv: -0.67073 0.0040656 -0.0796735 0.0965744 -0.1618384 0.029276 -0.1764532 0.0149767 -0.1911719 -0.6670545 -0.0584078 0.0442455 -0.1884981 -0.1951339 0.029288 0.1159865 0.0245155 -0.1671748 -0.0977087 -0.0122173 -0.0149407 0.0680158 0.0841089 0.0745643 -0.0531042 0.0321338 0.0762169 -0.1961109 -0.0057042 -0.0108269 -0.0080562 0.0995715 -0.0186088 0.006299 0.0231549 0.2002921 -0.2131506 0.0013481 -0.0020608 -0.0805746 0.0103129 0.0728513 0.0342245 0.0469507 0.0978555 0.866807 -0.0794494 0.2199341 -0.1105341 0.0924156 -0.0678167 0.2250958 -0.0498999 0.2073406 -0.0666625 -0.0047066 -0.0128203 0.0377491 -0.0938901 -0.0406964 -0.0099741 -0.0357303 0.0935321 0.8498415 0.2042154 -0.1333499 0.2249563 0.2207146 -0.0611199 -0.1327508 -0.0530691 0.1655686 0.0610808 0.0031569 0.0204251 -0.013733 0.027347 -0.002945 0.0172661 -0.0028302 -0.1452606 0.0616623 0.0000151 0.0164259 -0.0128758 0.0667713 0.0153713 0.001761 0.0542309 -0.1668451 0.0826087 0.017386 0.0044377 0.0088958 -0.1694789 -0.0708303 0.0057433 -0.0897339 0.0418361 0.085172 -0.0105751 0.0031993 0.0070208 -0.0945763 -0.0678947 -0.0059101 -0.07093 0.0358413 0.0599919 -0.0012125 -0.0243779 0.0177347 0.0631556 0.0379742 -0.017287 0.0462836 -0.1207636 -0.0426646 0.0856039 -0.0335588 0.0328794 -0.1069046 -0.0299913 -0.051938 -0.0329752 0.060439 -0.0404534 0.02127 -0.0749606 0.0286793 0.086714 0.0065042 -0.0000938 0.0450015 -0.1156466 -0.0379327 -0.1475089 0.0531468 -0.145801 -0.0000945 0.0165753 0.0635495 0.0306017 0.0548785 -0.0658248 0.1333897 -0.0292122 0.0955618 0.0627198 0.0100981 -0.0431849 0.0235151 0.081653 0.1032052 -0.0048682 -0.0212179 0.0003009 0.0560778 0.0601671 -0.0096103 -0.0174306 -0.1642379 -0.0399692 -0.0891212 0.0128618 -0.0206414 -0.0988225 -0.0480763 0.0365998 -0.05683 0.0531366 -0.0321075 -0.0566796 0.0623232 -0.0376541 0.0508303 0.0553095 -0.0062192 0.0680648 -0.0974896 unknown
polarizability: 149.5652049|5.5146623|74.1700777|3.7131099|-4.8741891|66.891154 unknown
InChI: InChI=1S/C6H12Br2/c1-6(5-8)3-2-4-7/h6H,2-5H2,1H3
charge 0 multiplicity 1
20 atoms
Br -4.067652 -0.187827 -0.594419
Br 4.415983 0.297222 -0.360282
C  -1.126304 0.112225 -0.156577
C  0.185626 -0.604574 0.293955
C  1.471056 0.141284 -0.153869
C  -2.30415 -0.798164 0.228305
C  -1.261693 1.524867 0.452364
C  2.716073 -0.677389 0.193929
H  -1.104648 0.197953 -1.261864
H  0.184446 -0.710707 1.398931
H  0.198807 -1.631395 -0.127674
H  1.532269 1.127984 0.338019
H  1.437881 0.321083 -1.24516
H  -2.183115 -1.82616 -0.148166
H  -2.494964 -0.804909 1.314126
H  -0.459907 2.195587 0.09834
H  -2.226915 1.980229 0.171061
H  -1.210726 1.482481 1.557742
H  2.760659 -1.637516 -0.343673
H  2.831073 -0.839972 1.277214
