program: Gaussian 09
title: 000225490
version: EM64L-G09RevD.01
frameworkgroup: C1[X(C8H12O4)]
method: RPBEPBE
basis: SDD
operation: Freq
keyword: #pfreq=noraman
keyword: PBEPBE/SDD
title: #p freq=noraman PBEPBE/SDD
converged: YES YES NO NO
title: Mulliken charges:
elementType: O O O O C C C C C C C C H H H H H H H H H H H H
charge: -0.415989 -0.230087 -0.430114 -0.254291 -0.365064 -0.362212 -0.462594 -0.487567 -0.074436 0.175494 -0.335667 0.170393 0.201930 0.212943 0.217561 0.220837 0.214854 0.220625 0.253665 0.254643 0.260949 0.260339 0.377390 0.376398
chargesum: 0.00000
title: Mulliken charges with hydrogens summed into heavy atoms:
elementType: O O O O C C C C C C C C
charge: -0.038599 -0.230087 -0.053715 -0.254291 0.049808 0.076186 -0.027116 0.020741 0.186513 0.175494 -0.075327 0.170393
polarizability: 1.53082180e+02 2.68690219e+00 8.57766235e+01 9.87829160e+00 -4.31476119e+00 7.23635419e+01
1716.lowfreq: -14.4778 -5.3583 0.0006 0.0009 0.0009 1.8834 16.1957 26.4907 43.2099
frequency: 15.7731 26.4533 43.1694 54.6056 93.6016 111.7950 115.9859 154.6239 187.5566 228.3489 251.0585 380.0117 392.3169 462.3728 498.0858 501.4258 583.3834 593.8964 612.3683 639.8818 690.5197 727.4568 776.5937 849.0592 860.2809 890.8893 927.8007 987.6399 1003.4597 1023.4303 1032.4972 1062.8604 1072.8346 1088.9986 1115.0466 1151.2929 1215.4337 1223.7205 1243.3641 1255.0455 1280.6343 1283.9749 1292.5858 1307.4789 1337.5980 1350.8955 1373.5251 1437.9361 1455.0238 1466.9074 1483.0114 1640.7016 1663.6724 1669.4621 2957.5212 2970.7803 2988.1531 2996.9630 3014.0513 3030.9798 3042.2092 3065.0896 3091.0527 3155.8357 3512.3455 3522.1767
redmass: 8.4330 5.6056 3.9710 3.7584 2.3133 6.5173 2.1747 2.8417 3.5988 4.7396 4.1845 3.5715 4.4099 3.6137 3.6415 1.8022 2.5284 1.8703 3.3798 1.3074 3.0886 1.1155 1.3577 2.5721 2.6524 2.2184 2.6046 1.5739 1.7523 3.5768 2.3537 1.8715 2.1953 2.4766 1.5926 1.7205 1.3249 1.3255 1.4092 1.4727 1.1817 1.1519 1.2095 1.5265 1.7533 1.7285 1.8543 1.0852 1.0940 1.0770 1.0986 8.5717 6.2799 8.2520 1.0624 1.0604 1.0613 1.0599 1.0966 1.0983 1.1006 1.1033 1.0910 1.0927 1.0640 1.0640
irintensity: 1.8398 0.1076 0.4664 1.6244 0.1548 0.5871 0.1894 0.7978 2.0191 0.5763 2.7752 5.7849 29.5640 15.5609 9.7279 29.0845 31.5420 86.4451 23.0139 132.2409 67.6685 16.5859 7.1567 2.4787 4.2431 5.4359 27.0890 87.0829 247.5828 59.1769 30.0174 255.6792 17.4889 48.9233 1.9089 17.0970 17.7520 11.6506 0.2139 18.4607 1.4645 2.5893 1.5310 6.3258 100.5817 17.6358 28.5989 29.4102 4.9298 0.0604 20.7593 262.6126 127.2147 203.9307 9.1065 25.9711 4.5820 35.0880 6.0472 2.5050 10.5958 68.0008 10.1997 6.2960 20.5929 39.7030
temp: 298.150 k
press: 1.00000 atm
elementType: 8 8 8 8 6 6 6 6 6 6 6 6 1 1 1 1 1 1 1 1 1 1 1 1
symmnumber: 1
zpe: 499653.3 jmol-1
zpe.correction: 0.190308 hartree
zpe.thermalcorrener: 0.203932 hartree
zpe.thermalcorrenthalpy: 0.204876 hartree
zpe.thermalcorrgfe: 0.146346 hartree
zpe.sumelectzpe: -612.013739 hartree
zpe.sumelectthermal: -612.000116 hartree
zpe.sumelectthermalent: -611.999171 hartree
zpe.sumelectthermalfe: -612.057701 hartree
dipole: -1.3579 0.2202 0.8327
dipole: 1.6081
quadrupole: -70.2385 -78.7108 -71.4054
quadrupole: -9.8610 2.8112 0.3417
quadrupole: 3.2131 -5.2592 2.0461 -9.8610 2.8112 0.3417
hfenergy: -612.2040472 hartree
pointgroup: C01 [X(C8H12O4)]
dipole: -0.5360304 0.1106209 0.3173288 debye
dipolederiv: -0.9645692 0.5499393 0.1535301 0.4980454 -0.6939961 -0.0939622 0.1552346 -0.1024514 -0.4648603 -0.7110386 -0.184716 -0.0211587 0.0658073 -0.9296813 -0.1512765 0.0468809 -0.1302965 -0.3363484 -1.0011815 0.3306158 -0.4827764 0.2943615 -0.4453396 0.1153537 -0.4926835 0.1357528 -0.7366636 -0.7793673 -0.1927394 0.0446693 -0.2536467 -0.7171007 0.2889167 0.0711838 0.2824605 -0.5901173 0.0490768 -0.0047871 0.0094845 -0.1986776 0.0852419 -0.0465471 0.0215879 -0.0168077 0.1796043 0.0404405 0.0000745 0.0094854 0.0979153 0.0568671 -0.0122679 0.0217283 -0.0199475 0.1562532 -0.3360108 -0.0237922 -0.0141523 0.0434062 0.0831647 0.0012405 -0.0916966 -0.0315303 0.1348291 -0.3379793 -0.0864091 0.0070458 -0.3069614 -0.0567868 -0.0380313 -0.0359424 -0.0421455 0.1436639 0.6269238 0.1201037 0.1377249 0.1519179 -0.0164467 -0.1161178 0.2998557 -0.0850129 0.0365891 1.4985592 -0.1598659 -0.1181134 -0.2256538 1.3601807 0.2905419 -0.1531134 0.2824673 0.2613078 -0.9765238 -0.100229 -0.1076482 -0.0961392 -0.0659194 -0.1278671 -0.2350592 -0.1451744 -0.1145878 1.9073717 0.0912206 0.4543366 0.3364788 0.8311841 -0.4375018 0.2973849 -0.4945074 0.8519808 0.0513219 -0.0015773 0.0149083 -0.0107168 -0.0798319 0.105516 0.0067982 0.1290936 -0.0311858 0.037399 -0.0047488 -0.0197656 0.0041393 0.015279 -0.0822914 -0.0114843 -0.1042491 -0.1124183 0.0480216 -0.0050998 -0.0154757 0.0011162 0.0316791 -0.0798062 -0.029603 -0.0878141 -0.1036271 0.0593741 0.0079892 0.0001604 0.0019295 -0.0559307 0.1002273 0.0175661 0.1076658 -0.01612 0.0186846 -0.0434703 -0.0695765 -0.0672045 0.0444209 -0.07571 -0.0004753 -0.0909503 -0.0769029 0.0257532 0.0105738 -0.0066354 -0.0039938 -0.0513946 0.0899009 0.0341894 0.1329836 -0.0193895 0.0701468 -0.0047026 0.0039471 0.0421809 -0.0085154 0.0818635 0.0013862 0.1084923 0.0291499 0.0699655 -0.0157641 -0.0181897 0.0299443 0.0736911 -0.0645561 0.0021817 -0.085368 -0.0506923 0.0830854 -0.0248676 -0.0014848 -0.0527873 0.0259364 0.096216 -0.0033852 0.09174 0.058995 0.0752469 -0.0473595 0.0020935 -0.0567616 0.0400721 0.1061978 0.0154787 0.1071495 0.0755005 0.1817005 -0.1030405 -0.0077365 -0.1539166 0.2192771 -0.0286116 -0.0194747 -0.0315207 0.3856706 0.2635989 -0.1073476 0.0453272 -0.1407833 0.2539488 0.0785728 0.081461 0.0899703 0.339369 unknown
polarizability: 152.9686848|3.0065162|85.1251023|10.2439911|-5.1795278|73.1285579 unknown
InChI: InChI=1S/C8H12O4/c9-7(10)5-3-1-2-4-6-8(11)12/h3,5,9,11H,1-2,4,6H2
charge 0 multiplicity 1
24 atoms
O  -5.378093 1.034992 0.379948
O  -4.719918 -1.123675 -0.166242
O  5.292239 -0.369086 1.001498
O  4.637048 1.125815 -0.65833
C  -0.506238 0.26507 -0.167374
C  -1.913328 -0.369192 -0.203603
C  0.610095 -0.775001 -0.46535
C  -3.015638 0.658292 0.114197
C  1.978088 -0.147777 -0.521589
C  -4.409295 0.061257 0.082462
C  3.043892 -0.50889 0.246784
C  4.345157 0.178982 0.114237
H  -0.445897 1.087859 -0.908977
H  -0.320674 0.72097 0.825506
H  -2.100636 -0.814368 -1.199639
H  -1.970667 -1.204765 0.519876
H  0.388789 -1.243988 -1.448027
H  0.583121 -1.582563 0.29036
H  -2.993462 1.504084 -0.600945
H  -2.864381 1.111638 1.113581
H  2.124116 0.675307 -1.239223
H  2.98537 -1.314871 0.985508
H  -6.281315 0.616259 0.352797
H  6.154927 0.113752 0.885748
