program: Gaussian 09
title: 000231561
version: EM64L-G09RevD.01
frameworkgroup: C1[X(C11H18O6)]
method: RPBEPBE
basis: SDD
operation: Freq
keyword: #pfreq=noraman
keyword: PBEPBE/SDD
title: #p freq=noraman PBEPBE/SDD
converged: YES YES NO NO
title: Mulliken charges:
elementType: O O O O O O C C C C C C C C C C C H H H H H H H H H H H H H H H H H H
charge: -0.278169 -0.257029 -0.252992 -0.244085 -0.243055 -0.248808 -0.416849 0.027866 -0.371111 -0.356506 -0.315740 0.291120 0.290680 -0.756517 0.284563 -0.748316 -0.753346 0.206210 0.229554 0.253677 0.252063 0.207344 0.253180 0.246332 0.235973 0.221977 0.250069 0.254299 0.246620 0.253887 0.246433 0.248388 0.245449 0.247644 0.249198
chargesum: 0.00000
title: Mulliken charges with hydrogens summed into heavy atoms:
elementType: O O O O O O C C C C C C C C C C C
charge: -0.278169 -0.257029 -0.252992 -0.244085 -0.243055 -0.248808 0.018915 0.281542 0.088295 0.143006 0.142210 0.291120 0.290680 -0.005529 0.284563 0.000391 -0.011055
polarizability: 1.49497046e+02 1.42432132e+01 1.48052934e+02 4.66217124e+00 1.73167137e+00 1.19094267e+02
1716.lowfreq: -8.0063 -1.8997 -0.0012 -0.0011 -0.0009 4.6952 16.8421 25.2435 27.1748
frequency: 16.8099 25.2336 27.1138 31.8464 33.8507 36.3419 38.4953 53.8777 65.5119 66.8132 75.5743 100.5061 123.8774 133.1603 187.5869 209.6803 247.5104 276.3877 286.6727 296.5483 343.1647 403.0482 418.7010 456.8612 483.4254 510.8718 563.3056 566.3957 570.3203 611.5409 620.8703 629.8224 743.2094 768.3037 786.4265 806.6295 882.9014 887.2635 936.3678 949.7416 956.5867 994.4925 1001.2711 1002.9980 1030.6782 1041.5560 1041.8287 1042.3860 1063.7802 1078.9118 1122.2193 1151.5181 1189.5866 1198.0927 1199.0689 1207.2930 1234.9988 1268.8208 1286.1208 1292.7912 1306.5169 1333.6507 1369.0967 1371.5715 1374.1765 1383.8563 1384.4696 1385.0661 1451.2631 1452.3600 1452.7887 1453.1385 1453.8409 1453.9377 1455.2019 1456.4017 1460.3269 1481.0988 1650.9490 1651.7464 1659.1428 2989.3046 2996.8772 3006.5174 3007.7223 3008.6279 3020.7166 3026.4748 3034.6689 3048.4904 3069.3785 3096.8459 3097.8509 3098.3683 3101.4936 3113.6567 3141.6760 3143.6329 3144.2403
redmass: 3.7011 3.4153 1.3255 1.6296 3.5899 3.3043 5.2152 1.5167 3.3378 1.9109 3.1589 2.4345 4.8149 2.6018 4.1311 6.9418 3.5266 2.8469 3.9062 3.1453 4.1249 3.6343 2.6713 3.7362 3.5942 3.2270 3.2021 3.1558 3.2354 4.7587 4.8135 4.2892 1.4390 2.5568 4.1103 2.4296 1.6861 4.1605 2.5124 4.3110 4.0533 1.9324 2.1399 2.3215 3.1248 1.6926 1.6626 1.6649 2.7220 2.1938 3.3244 2.0859 2.6210 3.3757 1.6563 2.9745 1.2312 1.2192 1.2501 1.0975 1.1605 1.2889 1.2696 1.3729 1.5661 1.2432 1.2696 1.2668 1.0893 1.0623 1.0625 1.0600 1.0527 1.0504 1.0586 1.0698 1.0873 1.0928 8.8716 9.3686 8.8943 1.0600 1.0616 1.0379 1.0374 1.0372 1.0579 1.0824 1.0628 1.0948 1.1021 1.0963 1.0965 1.0951 1.1080 1.1088 1.1018 1.1014 1.1014
irintensity: 0.8658 0.0249 0.8598 0.6380 4.3028 0.0578 1.5648 4.6047 1.9663 0.9038 1.3239 0.6636 1.2142 0.5177 7.9402 2.8896 0.1445 13.6016 1.1678 18.6748 24.0263 7.0321 1.3525 1.0177 8.0188 2.0906 0.7687 7.4323 8.0668 12.1801 1.5210 7.0468 5.8221 18.5512 29.1328 0.4300 4.2333 15.2507 23.6526 69.1817 29.2562 85.2658 156.8813 66.0115 25.3602 11.4987 11.4818 13.3383 14.9175 23.0014 6.9003 14.8380 491.6126 210.8937 44.7636 223.5627 15.9881 9.9767 4.6116 2.7825 4.5782 0.9681 4.4724 5.3336 0.6267 118.3650 42.0680 1.5086 1.7656 22.4482 26.4078 34.8119 33.0018 4.6674 20.0145 4.1871 16.5586 11.6999 90.9188 300.1751 129.7413 9.8262 20.5768 2.3534 1.6148 1.7990 42.5950 1.7334 15.7792 13.0312 14.7341 6.4687 7.0077 9.3541 28.2413 5.4226 9.0933 9.8340 8.8033
temp: 298.150 k
press: 1.00000 atm
elementType: 8 8 8 8 8 8 6 6 6 6 6 6 6 6 6 6 6 1 1 1 1 1 1 1 1 1 1 1 1 1 1 1 1 1 1
symmnumber: 1
zpe: 737286.7 jmol-1
zpe.correction: 0.280818 hartree
zpe.thermalcorrener: 0.301877 hartree
zpe.thermalcorrenthalpy: 0.302821 hartree
zpe.thermalcorrgfe: 0.223961 hartree
zpe.sumelectzpe: -879.984987 hartree
zpe.sumelectthermal: -879.963928 hartree
zpe.sumelectthermalent: -879.962984 hartree
zpe.sumelectthermalfe: -880.041844 hartree
dipole: 0.0686 -0.7715 -1.5767
dipole: 1.7567
quadrupole: -92.7998 -94.2328 -111.5436
quadrupole: 4.3688 -5.0030 12.0478
quadrupole: 6.7256 5.2926 -12.0182 4.3688 -5.0030 12.0478
hfenergy: -880.2658047 hartree
pointgroup: C01 [X(C11H18O6)]
dipole: -0.1495243 0.3259981 -0.5908069 debye
polarizability: 142.7338911|13.3982547|154.0604724|-5.8625449|-2.0416976|119.8498838 unknown
InChI: InChI=1S/C11H18O6/c1-8(12)15-6-4-5-11(17-10(3)14)7-16-9(2)13/h11H,4-7H2,1-3H3
charge 0 multiplicity 1
35 atoms
O  0.924368 -1.745341 0.450425
O  2.962675 1.243274 -0.550318
O  -3.738415 0.779074 0.046587
O  1.757249 -2.845222 -1.435986
O  2.907557 2.409035 1.479377
O  -3.976717 -0.733512 1.810046
C  0.103872 0.540963 0.355756
C  1.163126 -0.415456 -0.202089
C  -1.331247 0.136684 -0.049793
C  2.614562 -0.026327 0.140236
C  -2.364528 1.113973 0.526277
C  1.263402 -2.892733 -0.287603
C  3.098742 2.397143 0.244357
C  0.951967 -4.137273 0.512327
C  -4.438425 -0.185497 0.783419
C  3.519095 3.567081 -0.616528
C  -5.785376 -0.455684 0.148685
H  0.330462 1.55695 -0.022585
H  0.198205 0.578056 1.458028
H  1.063901 -0.546969 -1.296243
H  -1.545305 -0.880594 0.323005
H  -1.422024 0.120718 -1.153559
H  3.314208 -0.775733 -0.262521
H  2.743257 0.095663 1.230011
H  -2.356986 1.092363 1.631274
H  -2.204243 2.143153 0.163714
H  1.651266 -4.219602 1.363588
H  -0.06695 -4.083841 0.930355
H  1.055294 -5.024846 -0.12822
H  4.556608 3.417747 -0.964889
H  3.463722 4.497003 -0.032703
H  2.880576 3.638158 -1.512683
H  -6.439187 -0.967884 0.869637
H  -5.653022 -1.105213 -0.735759
H  -6.250391 0.482287 -0.194628
