program: Gaussian 09
title: 000231521
version: EM64L-G09RevD.01
frameworkgroup: C1[X(C17H18O)]
method: RPBEPBE
basis: SDD
operation: Freq
keyword: #pfreq=noraman
keyword: PBEPBE/SDD
title: #p freq=noraman PBEPBE/SDD
converged: YES YES NO NO
title: Mulliken charges:
elementType: O C C C C C C C C C C C C C C C C C H H H H H H H H H H H H H H H H H H
charge: -0.232434 0.065692 -0.509301 0.322091 -0.425204 -0.545467 -0.415347 0.241948 0.247966 -0.673506 0.322752 -0.429058 -0.552962 -0.845369 0.329647 -0.388183 0.097822 -0.792465 0.220448 0.220977 0.204992 0.210616 0.226791 0.220435 0.206045 0.209266 0.237033 0.244586 0.293157 0.238042 0.237823 0.239075 0.239885 0.236493 0.236326 0.259387
chargesum: 0.00000
title: Mulliken charges with hydrogens summed into heavy atoms:
elementType: O C C C C C C C C C C C C C C C C C
charge: -0.232434 0.065692 -0.067876 0.322091 -0.009595 -0.098241 -0.000036 0.241948 0.247966 -0.436472 0.322752 -0.184472 -0.259805 -0.130429 0.329647 -0.148298 0.097822 -0.060258
polarizability: 2.97534634e+02 -1.19342273e+01 2.02110849e+02 5.10672955e-01 -7.63926058e-01 9.83641172e+01
1716.lowfreq: -11.3337 -7.5815 -2.4021 -0.0008 -0.0008 -0.0006 48.7290 57.2315 79.3175
frequency: 48.7259 57.1387 79.3004 111.8770 128.5409 149.3958 162.2176 168.0181 199.6220 222.5870 248.6985 270.7593 290.7544 314.4229 355.8920 401.4385 424.2865 431.6314 450.9407 494.9393 503.7148 513.4799 539.8202 564.9953 574.9096 601.7988 618.8839 680.1930 687.3829 710.1782 788.9078 817.1688 819.6502 843.0911 870.7075 881.2130 894.1507 916.7599 951.7730 957.3382 969.3253 971.6295 981.0398 1002.1004 1027.0324 1046.7626 1065.8629 1083.4434 1086.1652 1101.9002 1112.9058 1134.3302 1166.6866 1189.2492 1218.5002 1237.2603 1249.5985 1264.3516 1282.0546 1287.7775 1309.8347 1335.2518 1344.7280 1350.5205 1359.1985 1372.4544 1387.6872 1401.0750 1418.1637 1426.6796 1447.2088 1451.6050 1456.2604 1459.9982 1463.1607 1470.4092 1471.8676 1476.7187 1486.3255 1511.9465 1569.7519 1589.4304 1612.3280 1627.7787 2952.5841 2953.3948 2975.7137 2978.3544 2980.7403 2984.1849 3011.2989 3015.7205 3041.4326 3049.2348 3051.6236 3068.1996 3085.8961 3109.4100 3124.4927 3137.9738 3151.9289 3161.8957
redmass: 5.4409 3.4825 2.7042 2.9653 4.4058 1.1922 1.9270 1.4895 1.8863 4.7647 3.5524 3.1486 3.2233 1.9499 3.2288 4.1783 3.1097 3.6673 3.5930 3.3896 4.2456 3.9370 3.9926 3.2624 2.8311 3.4335 3.5969 3.0571 4.3221 3.5334 2.5301 1.5807 3.1880 1.8418 3.5237 1.6266 2.0039 1.4694 1.4643 2.3460 1.7734 1.5031 3.3756 1.9292 1.8465 1.5744 2.2005 1.9371 2.4955 1.6689 2.5090 1.1537 1.4556 1.5107 1.6775 1.9709 1.2854 1.3317 2.3659 2.2184 1.6222 1.4665 1.4629 1.9480 1.7363 1.3259 3.1555 1.3741 5.3159 3.9251 1.1118 1.2438 1.3384 1.6662 1.0497 1.0456 1.0884 1.0958 1.2676 3.4640 7.0317 7.3268 6.1692 6.9367 1.0638 1.0643 1.0378 1.0656 1.0623 1.0376 1.0931 1.0941 1.0983 1.1041 1.0972 1.0969 1.0985 1.0908 1.0991 1.0863 1.0906 1.0960
irintensity: 1.1759 4.3878 0.6189 0.0825 2.3785 0.8187 0.0325 3.3251 1.2720 1.9739 0.6329 1.4525 0.5565 0.8461 1.9811 0.6092 3.8019 2.5536 2.4732 3.7075 0.9416 6.9852 7.3176 0.9525 1.5561 9.4002 2.8909 10.1971 5.2098 1.0945 2.6066 18.5323 9.0113 13.8237 11.2020 6.0168 6.6337 3.0368 20.3971 25.8719 9.2906 0.5593 1.0245 4.7856 0.5233 5.4992 1.5401 0.3780 0.3930 0.3251 1.6400 2.1660 0.5765 2.7551 4.8708 203.9202 6.4984 7.9414 1.2872 142.7026 4.0887 0.7040 4.0626 1.5359 0.6879 80.7123 2.4063 18.2632 14.3832 10.9670 33.7271 9.0167 10.9792 32.1675 20.2362 13.8743 10.7500 10.0999 39.9208 3.4651 155.1907 31.4382 56.4634 36.6384 30.5918 19.3054 31.3815 34.7107 29.4878 3.7200 42.0875 24.7637 78.4432 61.7614 17.1819 13.3487 17.4382 28.2320 22.4490 3.3554 2.1986 18.4824
temp: 298.150 k
press: 1.00000 atm
elementType: 8 6 6 6 6 6 6 6 6 6 6 6 6 6 6 6 6 6 1 1 1 1 1 1 1 1 1 1 1 1 1 1 1 1 1 1
symmnumber: 1
zpe: 788696.4 jmol-1
zpe.correction: 0.300399 hartree
zpe.thermalcorrener: 0.316419 hartree
zpe.thermalcorrenthalpy: 0.317364 hartree
zpe.thermalcorrgfe: 0.257397 hartree
zpe.sumelectzpe: -732.575790 hartree
zpe.sumelectthermal: -732.559769 hartree
zpe.sumelectthermalent: -732.558825 hartree
zpe.sumelectthermalfe: -732.618791 hartree
dipole: -3.7571 -2.1442 0.0207
dipole: 4.3259
quadrupole: -111.0337 -96.0587 -109.3423
quadrupole: -11.5668 0.2838 -0.2664
quadrupole: -5.5554 9.4196 -3.8641 -11.5668 0.2838 -0.2664
hfenergy: -732.8761884 hartree
pointgroup: C01 [X(C17H18O1)]
dipole: 1.4726565 -0.8531214 -0.0102573 debye
polarizability: 297.6849114|11.3131636|201.954785|0.6077749|1.0723459|98.3699041 unknown
InChI: InChI=1S/C17H18O/c1-11-9-14-5-3-4-6-15(14)16-8-7-13(12(2)18)10-17(11)16/h7-10H,3-6H2,1-2H3
charge 0 multiplicity 1
36 atoms
O  -4.679952 0.857576 -0.003123
C  1.712318 -0.553658 0.02176
C  2.426454 -1.905054 0.031919
C  2.435556 0.652062 0.014401
C  3.933619 -1.806848 0.357789
C  3.961093 0.685667 -0.003787
C  4.590453 -0.655761 -0.430489
C  0.267373 -0.500188 0.00698
C  -0.422291 0.779195 0.02032
C  1.73848 1.906458 0.02549
C  0.347889 2.004786 0.037096
C  -0.53383 -1.692653 -0.028678
C  -1.8479 0.798402 0.012293
C  -0.333115 3.360361 0.055149
C  -2.610378 -0.382011 -0.015909
C  -1.927186 -1.642383 -0.040599
C  -4.107284 -0.274004 -0.020829
C  -4.936812 -1.55502 -0.04907
H  1.942352 -2.578648 0.765611
H  2.297813 -2.39106 -0.958657
H  4.069157 -1.62283 1.442623
H  4.424569 -2.771728 0.130294
H  4.29857 1.502908 -0.670676
H  4.326693 0.951612 1.010984
H  4.433959 -0.816989 -1.515958
H  5.68277 -0.634209 -0.257499
H  2.336698 2.827159 0.023425
H  -0.039749 -2.668414 -0.053868
H  -2.393525 1.74752 0.026637
H  -0.97939 3.506828 -0.830781
H  -0.977635 3.482251 0.946066
H  0.412107 4.173132 0.06575
H  -2.499232 -2.575654 -0.069761
H  -4.719804 -2.189132 0.830877
H  -4.713571 -2.154543 -0.951465
H  -6.004769 -1.289729 -0.047914
