program: Gaussian 09
title: 000231528
version: EM64L-G09RevD.01
frameworkgroup: C1[X(C19H14ClNO)]
method: RPBEPBE
basis: SDD
operation: Freq
keyword: #p
keyword: freq=noraman
keyword: PBEPBE/SDD
title: #p freq=noraman PBEPBE/SDD
converged: YES YES NO NO
title: Mulliken charges:
elementType: Cl O N C C C C C C C C C C C C C C C C C C C H H H H H H H H H H H H H H
charge: -0.064702 -0.267470 -0.477472 0.174059 0.308399 0.267114 -0.341101 -0.338952 -0.423874 -0.392794 -0.132143 -0.228341 0.128741 0.236646 -0.224140 -0.224975 -0.239328 -0.338149 -0.340243 -0.225228 -0.243111 -0.227928 0.273775 0.316768 0.336608 0.278232 0.254632 0.257019 0.234919 0.232462 0.235760 0.276549 0.218153 0.234175 0.231794 0.234147
chargesum: 0.00000
title: Mulliken charges with hydrogens summed into heavy atoms:
elementType: Cl O N C C C C C C C C C C C C C C C C C C C
charge: -0.064702 -0.267470 -0.140864 0.174059 0.308399 0.267114 -0.067326 -0.022184 -0.145642 -0.138162 -0.132143 0.028678 0.128741 0.236646 0.010779 0.007487 -0.003568 -0.061600 -0.122090 0.008947 -0.011317 0.006219
polarizability: 3.35416848e+02 1.88287530e+01 2.60687652e+02 1.88392842e+01 -1.67081101e+01 1.15452851e+02
1716.lowfreq: -8.0687 -4.5509 -0.0017 -0.0010 0.0014 2.2477 23.1637 32.2904 37.9290
frequency: 23.0540 32.2821 37.9007 55.5127 67.0012 83.9428 96.0191 134.8213 148.1268 194.2775 222.8205 234.3912 266.6929 292.7516 324.0542 360.2136 379.8992 401.2940 405.5340 419.5216 430.5457 483.7527 497.5308 538.1799 572.1997 614.2527 614.5921 617.6437 632.7597 676.7640 680.1554 687.9790 703.9503 715.3345 738.7300 753.4851 775.1284 791.9533 831.1737 842.7082 852.6049 863.8466 869.7148 879.2402 932.4328 935.9991 980.5529 983.6175 985.8962 987.3617 989.1995 1000.5504 1003.6002 1007.9396 1024.4975 1036.7001 1075.5894 1080.8331 1087.5222 1093.8987 1131.8415 1174.0426 1174.8688 1192.7584 1195.3806 1229.1920 1244.7183 1268.1019 1293.7248 1314.2712 1322.8600 1361.3054 1368.0171 1385.0176 1394.3927 1429.2513 1434.2705 1455.9432 1478.0575 1487.5652 1506.1888 1569.3604 1576.7167 1583.2322 1603.5891 1608.6072 1610.7340 1611.1765 3116.2676 3124.0528 3129.6156 3133.0554 3141.4992 3146.1781 3151.5747 3159.3688 3162.2691 3167.1377 3167.7084 3170.7303 3193.3904 3499.4159
redmass: 4.7119 5.4895 4.8587 4.6566 7.5965 5.4599 5.1156 6.3701 6.7729 5.6904 7.5914 5.6828 5.1908 6.7776 7.2734 4.8007 7.6579 2.8384 2.9063 4.9623 4.3472 4.6361 3.8969 4.0542 4.1360 6.4607 6.4677 7.0501 6.2754 5.1126 2.5249 1.9130 1.5248 2.1922 2.4967 4.7748 2.0758 2.4598 5.5820 1.3892 1.3086 1.2561 5.6246 1.3906 1.3820 1.4363 1.3138 1.6014 1.5337 3.2211 5.1165 1.4109 4.4985 1.3462 2.5501 2.0765 2.4927 1.7303 1.7513 2.0601 1.5179 1.0596 1.0537 1.1192 1.1207 1.9410 3.1170 1.5025 2.5347 1.4541 1.3859 6.0596 5.6396 8.5021 4.0965 2.3682 2.2782 2.4163 2.2282 2.4724 2.5620 7.0828 5.0033 5.8448 7.3519 5.9009 5.2422 5.0491 1.0879 1.0866 1.0869 1.0868 1.0919 1.0919 1.0963 1.0956 1.0926 1.0912 1.1016 1.1006 1.0954 1.0757
irintensity: 0.3664 0.1680 0.3153 0.2716 3.4630 0.3606 0.8937 1.2298 1.7492 0.2564 0.5369 2.5534 0.1820 3.9459 9.6043 0.0408 6.0499 0.5248 0.1557 7.9791 4.9322 3.2612 14.1430 14.2024 15.5573 0.6237 0.4669 3.3186 8.0276 12.8532 8.9145 19.7010 161.0306 13.0886 10.6099 23.7538 33.1946 15.7245 31.3462 49.2054 1.9923 3.1380 15.5228 10.1657 3.7516 2.1429 4.0974 2.3339 1.7390 1.4120 0.5647 3.9026 12.4043 1.6730 11.1276 13.9113 24.7076 17.8290 3.4175 10.7203 2.0673 2.3542 0.0484 1.7817 10.3321 8.9372 90.2371 26.7557 59.8836 6.2077 8.0021 67.2244 25.6813 0.8582 114.2653 14.1987 1.1327 65.1150 123.0130 6.2795 569.7190 76.7835 13.6312 15.1954 12.6146 22.6186 16.8743 15.5918 14.0985 3.6403 0.5618 1.3018 9.6954 20.7649 26.2197 13.2011 0.8482 2.2715 21.0328 24.4182 11.2930 62.3678
temp: 298.150 k
press: 1.00000 atm
elementType: 17 8 7 6 6 6 6 6 6 6 6 6 6 6 6 6 6 6 6 6 6 6 1 1 1 1 1 1 1 1 1 1 1 1 1 1
symmnumber: 1
zpe: 720857.6 jmol-1
zpe.correction: 0.274560 hartree
zpe.thermalcorrener: 0.292797 hartree
zpe.thermalcorrenthalpy: 0.293741 hartree
zpe.thermalcorrgfe: 0.225677 hartree
zpe.sumelectzpe: -1320.980744 hartree
zpe.sumelectthermal: -1320.962507 hartree
zpe.sumelectthermalent: -1320.961563 hartree
zpe.sumelectthermalfe: -1321.029627 hartree
dipole: 3.2432 4.7236 -0.2119
dipole: 5.7338
quadrupole: -129.9755 -127.1518 -135.5359
quadrupole: 1.6667 3.7512 -3.5247
quadrupole: 0.9122 3.7360 -4.6482 1.6667 3.7512 -3.5247
hfenergy: -1321.2553038 hartree
pointgroup: C01 [X(C19H14Cl1N1O1)]
dipole: 1.0384139 1.9994352 -0.1129135 debye
polarizability: 326.0527224|29.9475768|264.9434282|32.985133|-19.4797815|120.5611998 unknown
InChI: InChI=1S/C19H14ClNO/c20-16-11-12-18(17(13-16)14-7-3-1-4-8-14)21-19(22)15-9-5-2-6-10-15/h1-13,21H
charge 0 multiplicity 1
36 atoms
Cl -5.489434 -2.254881 -0.360505
O  1.449611 -2.773453 0.338607
N  0.358222 -0.715972 0.025764
C  -2.001388 -0.077024 -0.100645
C  -1.006481 -1.108256 -0.006823
C  -1.653085 1.379487 -0.089809
C  -3.362628 -0.450997 -0.221052
C  -1.400323 -2.47384 0.003298
C  -0.876863 1.94928 0.959802
C  -2.134426 2.237858 -1.116279
C  -3.724676 -1.808506 -0.219216
C  -2.761306 -2.825873 -0.099448
C  1.495287 -1.516229 0.156343
C  2.810889 -0.779351 0.093186
C  -0.582243 3.33115 0.972695
C  -1.840955 3.618913 -1.101643
C  -1.059834 4.17109 -0.059652
C  3.948432 -1.456927 0.604046
C  2.971738 0.518923 -0.462277
C  5.217155 -0.843803 0.583009
C  4.244126 1.130798 -0.485785
C  5.368707 0.45497 0.041607
H  -4.130056 0.325966 -0.28342
H  -0.631273 -3.243257 0.088117
H  0.513089 0.293812 -0.03476
H  -0.543108 1.317535 1.791687
H  -2.726589 1.812425 -1.934534
H  -3.059339 -3.878022 -0.089875
H  0.007229 3.751031 1.795186
H  -2.218262 4.262386 -1.904102
H  -0.832372 5.242576 -0.048833
H  3.807595 -2.465773 1.005143
H  2.128062 1.055092 -0.914672
H  6.086478 -1.375391 0.984816
H  4.359064 2.127986 -0.92427
H  6.354656 0.932276 0.021894
