program: Gaussian 09
title: 000231524
version: EM64L-G09RevD.01
frameworkgroup: C1[X(C18H21NO)]
method: RPBEPBE
basis: SDD
operation: Freq
keyword: #p
keyword: freq=noraman
keyword: PBEPBE/SDD
title: #p freq=noraman PBEPBE/SDD
converged: NO YES NO NO
title: Mulliken charges:
elementType: O N C C C C C C C C C C C C C C C C C C H H H H H H H H H H H H H H H H H H H H H
charge: -0.257826 -0.445028 0.039739 -0.510611 0.378360 -0.424595 -0.547933 -0.417151 0.257404 0.210502 -0.634834 0.274814 -0.424482 -0.587711 0.528517 -0.443919 -0.547041 -0.675164 0.209225 -0.805383 0.218598 0.217537 0.207288 0.204500 0.219004 0.233845 0.207069 0.204142 0.310852 0.244594 0.191001 0.233910 0.312234 0.210719 0.204620 0.222093 0.217327 0.224190 0.235370 0.268363 0.235859
chargesum: 0.00000
title: Mulliken charges with hydrogens summed into heavy atoms:
elementType: O N C C C C C C C C C C C C C C C C C C
charge: -0.257826 -0.132793 0.039739 -0.074476 0.378360 -0.012807 -0.095083 -0.005940 0.257404 0.210502 -0.323982 0.274814 -0.179888 -0.396710 0.528517 -0.210009 -0.131702 -0.011554 0.209225 -0.065791
polarizability: 2.83935967e+02 -9.60745460e+00 2.59867667e+02 -5.60948467e+00 3.44556200e+00 1.13452007e+02
1716.lowfreq: -92.2235 -12.0053 -0.0005 0.0001 0.0003 3.6649 9.4114 16.1062 33.2449
frequency: -92.2212 12.0734 33.1977 51.1200 55.7713 98.6799 107.1728 112.1342 149.8663 168.7785 199.4932 220.9209 228.4391 261.7296 283.5688 293.4530 325.5911 332.7374 382.6675 418.8515 437.8548 443.3392 470.2498 495.3976 522.5690 546.0631 565.3417 575.7108 597.5546 611.1845 637.3836 649.7891 683.0362 707.3683 748.5203 778.3900 784.1211 820.6697 838.5003 850.5746 864.8381 881.5359 894.1079 903.3678 926.6758 948.6298 967.0891 969.6506 979.8811 980.4034 990.5122 1027.7716 1055.2657 1068.3582 1077.1343 1083.9970 1101.7878 1116.9573 1133.9269 1167.2094 1183.9359 1204.0632 1222.8669 1236.2498 1246.5317 1248.3490 1263.7740 1279.8969 1282.6360 1309.3914 1314.9673 1335.0644 1343.9549 1356.3429 1364.5464 1372.3467 1386.4110 1392.0752 1417.9580 1418.6735 1443.8451 1453.4045 1458.2776 1461.2737 1467.9212 1469.6072 1471.0919 1472.7497 1474.4677 1488.8931 1505.2107 1532.6491 1586.7912 1607.6150 1630.7902 1637.5713 2947.9910 2957.5614 2976.0278 2978.7744 2979.1503 2980.7260 2985.1106 3007.2189 3022.6067 3030.5925 3038.7348 3047.2235 3070.0556 3078.1735 3083.0349 3091.6451 3119.8451 3134.4018 3160.1722 3170.0703 3548.7118
redmass: 1.0571 2.4666 4.1569 4.0692 3.4012 2.8989 2.8768 3.9270 3.1879 2.2748 3.1488 1.4397 3.2253 5.3240 2.6215 3.2461 2.2453 2.9515 3.1535 3.4782 3.1855 3.6767 3.2317 3.8733 5.3507 2.6576 3.5708 3.1891 2.9486 1.6895 2.7041 3.9562 3.4088 4.6122 3.4577 1.8498 1.4065 1.4399 1.8195 2.8236 1.9591 3.3358 2.1965 1.7902 3.7720 1.3896 1.9950 1.5933 2.6744 2.2434 2.1468 1.6579 1.9619 1.7564 2.6443 1.8954 1.6488 2.2666 1.1576 1.4796 1.5240 1.7775 1.9922 1.8082 1.3622 1.2895 1.3380 2.6926 1.7507 1.5577 1.6175 1.4737 1.4325 1.5918 2.0176 1.2420 1.2210 4.7878 3.1916 5.9945 1.4951 1.1495 1.1589 1.7113 1.0475 1.0963 1.0444 1.0783 1.0969 1.0965 2.3579 2.7431 7.5629 6.4589 6.5933 4.3255 1.0639 1.0653 1.0652 1.0488 1.0618 1.0460 1.0383 1.0927 1.0942 1.1013 1.0983 1.1041 1.0984 1.1001 1.1009 1.0887 1.0886 1.0977 1.0938 1.0922 1.0753
irintensity: 0.0078 0.0831 6.3989 1.6273 3.9080 1.2974 0.1957 4.6055 0.4500 1.3859 2.4339 0.0694 0.2618 2.7707 1.5161 0.4318 0.1563 0.8344 2.7350 3.5005 0.0906 3.0419 0.6960 0.9146 10.8932 2.1782 4.7060 1.3929 2.3598 28.7272 21.8741 12.0101 9.3061 0.4288 3.0143 3.0838 3.0230 19.9217 24.7097 5.2376 9.9294 4.2010 6.0634 4.0546 5.8708 25.3130 15.2320 6.4758 4.4765 0.7489 9.6722 7.4794 12.7890 7.1764 1.2119 1.0602 0.6991 0.4786 1.8518 0.9686 5.1711 6.6274 31.7190 19.7961 7.4897 11.6612 4.2633 2.3128 24.4474 19.7256 25.6906 0.1899 3.4404 0.9681 23.6962 47.6997 9.5993 12.7369 197.5378 12.6555 65.9621 0.6304 19.6001 4.6586 19.3794 12.1825 15.0552 2.3927 12.2737 20.4377 189.0311 230.2638 13.6650 67.3163 85.8964 47.0044 29.8876 24.7306 37.7978 39.7206 40.5218 38.7487 9.5722 39.9946 25.2866 9.1606 83.1452 65.7357 16.1422 59.4440 33.0186 44.9566 15.7241 8.0737 18.1314 4.5354 21.2225
temp: 298.150 k
press: 1.00000 atm
elementType: 8 7 6 6 6 6 6 6 6 6 6 6 6 6 6 6 6 6 6 6 1 1 1 1 1 1 1 1 1 1 1 1 1 1 1 1 1 1 1 1 1
symmnumber: 1
zpe: 905507.2 jmol-1
zpe.correction: 0.344889 hartree
zpe.thermalcorrener: 0.363044 hartree
zpe.thermalcorrenthalpy: 0.363989 hartree
zpe.thermalcorrgfe: 0.296886 hartree
zpe.sumelectzpe: -827.083267 hartree
zpe.sumelectthermal: -827.065112 hartree
zpe.sumelectthermalent: -827.064168 hartree
zpe.sumelectthermalfe: -827.131271 hartree
dipole: 3.0418 -2.0149 -0.1241
dipole: 3.6507
quadrupole: -103.1717 -118.8537 -123.1061
quadrupole: 13.1610 -0.9258 -0.2207
quadrupole: 11.8722 -3.8099 -8.0623 13.1610 -0.9258 -0.2207
hfenergy: -827.4281569 hartree
pointgroup: C01 [X(C18H21N1O1)]
dipole: -1.2521321 0.7031562 -0.0259457 debye
polarizability: 285.2898968|-7.8491579|258.6484468|4.477551|-0.0670465|113.3172985 unknown
InChI: InChI=1S/C18H21NO/c1-3-13-8-9-16-15-7-5-4-6-14(15)11-18(17(16)10-13)19-12(2)20/h8-11,19H,3-7H2,1-2H3
charge 0 multiplicity 1
41 atoms
O  1.033528 -4.131013 0.022985
N  -0.674321 -2.512192 -0.066532
C  1.485413 1.211105 0.029951
C  2.239286 2.539768 0.08166
C  2.167466 -0.016724 0.06006
C  3.72426 2.395156 0.484076
C  3.690385 -0.098442 0.130698
C  4.384002 1.220172 -0.265587
C  0.041919 1.203677 -0.069006
C  -0.698109 -0.04312 -0.105346
C  1.446758 -1.250641 0.027563
C  0.050398 -1.284999 -0.04397
C  -0.709177 2.425485 -0.147152
C  -2.128486 0.006125 -0.20953
C  -2.841706 1.209555 -0.274877
C  -2.100098 2.433482 -0.245044
C  -4.361509 1.233526 -0.345274
C  -5.015816 1.588453 1.01726
C  -0.193615 -3.823439 -0.032851
C  -1.300852 -4.880358 -0.069357
H  2.177258 3.031911 -0.912563
H  1.740496 3.228002 0.792046
H  4.25576 3.343819 0.279164
H  3.799158 2.211954 1.574985
H  3.988034 -0.369296 1.165855
H  4.038593 -0.930665 -0.51043
H  5.464646 1.164934 -0.035067
H  4.290187 1.382049 -1.358316
H  1.993614 -2.19589 0.058642
H  -0.173838 3.379528 -0.140126
H  -2.721954 -0.917589 -0.247214
H  -2.63899 3.386939 -0.308195
H  -1.690234 -2.425884 -0.110251
H  -4.688857 1.973866 -1.101557
H  -4.739068 0.249143 -0.68258
H  -4.743786 0.846383 1.789403
H  -6.117726 1.612049 0.931651
H  -4.678955 2.579062 1.372933
H  -1.984544 -4.780525 0.794325
H  -0.832843 -5.874497 -0.034492
H  -1.901678 -4.80437 -0.99484
