program: Gaussian 09
title: 000231511
version: EM64L-G09RevD.01
frameworkgroup: C1[X(C14H12ClNO)]
method: RPBEPBE
basis: SDD
operation: Freq
keyword: #p
keyword: freq=noraman
keyword: PBEPBE/SDD
title: #p freq=noraman PBEPBE/SDD
converged: NO YES NO NO
title: Mulliken charges:
elementType: Cl O N C C C C C C C C C C C C C C H H H H H H H H H H H H
charge: -0.066161 -0.256106 -0.433789 0.139194 0.306902 0.192489 -0.336742 -0.343911 -0.363786 -0.363758 -0.116721 -0.219357 -0.219288 -0.219291 -0.236273 0.201311 -0.801474 0.273226 0.315612 0.254669 0.254662 0.336579 0.256069 0.233475 0.233473 0.234103 0.238656 0.267647 0.238588
chargesum: 0.00000
title: Mulliken charges with hydrogens summed into heavy atoms:
elementType: Cl O N C C C C C C C C C C C C C C
charge: -0.066161 -0.256106 -0.097210 0.139194 0.306902 0.192489 -0.063516 -0.028298 -0.109117 -0.109096 -0.116721 0.036712 0.014187 0.014182 -0.002170 0.201311 -0.056583
polarizability: 2.24525143e+02 4.06795483e+00 1.80347916e+02 -4.85659629e-03 1.16742088e-02 1.10784521e+02
1716.lowfreq: -74.8884 -40.7707 -7.4244 -5.2173 -0.0019 -0.0013 -0.0011 7.7047 55.9887
frequency: -74.8847 -40.7665 55.9884 57.8922 61.7753 91.3047 123.8239 153.4650 213.8796 240.6514 261.2769 278.1653 311.2754 365.9839 397.2257 398.5866 425.8700 483.5074 530.1233 567.9966 584.0738 593.7150 615.5405 618.0238 670.8083 680.5512 707.7212 745.3662 760.3684 777.3271 826.6894 844.9121 859.6834 882.1115 926.9927 932.8741 980.7518 982.4719 986.5839 987.8370 999.8827 1004.2677 1031.5335 1035.9064 1076.2686 1081.2142 1126.6890 1173.6493 1187.2805 1215.9831 1229.6629 1265.5232 1298.4055 1309.4052 1361.3798 1366.2196 1377.0017 1395.1332 1427.9374 1439.0214 1459.3672 1466.9228 1482.8159 1505.0271 1578.7417 1581.0396 1602.7534 1613.1211 1630.1092 2988.5319 3073.1598 3126.8583 3131.7164 3138.6860 3143.3051 3152.4441 3164.2693 3165.2205 3167.4734 3192.5425 3491.3385
redmass: 1.0452 3.8877 5.3378 7.6088 3.9761 4.5341 6.9031 5.0180 5.2473 6.7413 4.8966 5.9020 6.5441 4.3547 4.8101 2.8424 5.0743 3.3018 3.8466 4.5455 3.1202 4.3363 6.2229 6.9941 6.3423 1.1852 1.7487 4.5001 3.5412 2.4461 5.0613 1.3868 1.2436 1.3856 1.5303 4.5864 1.3787 1.3120 3.8792 1.9677 1.3831 4.6044 1.6627 2.0508 1.6091 2.0825 1.5226 1.0536 1.1168 3.0076 1.8554 1.4565 2.6904 1.3829 7.1057 6.5779 1.2645 3.9160 2.1921 1.5069 1.5717 1.0465 2.2596 2.6244 5.9663 5.9443 6.3067 6.6062 4.8738 1.0384 1.0982 1.0849 1.0880 1.0981 1.0926 1.0968 1.0922 1.0919 1.1018 1.0955 1.0764
irintensity: 0.1812 0.0051 0.0458 4.3970 2.3583 3.1037 3.8051 0.1221 4.0586 0.8371 0.0829 0.8721 3.5999 0.0083 1.1321 0.0145 18.2173 16.9303 16.0993 3.6158 0.2992 6.8876 0.0381 6.7367 14.5019 38.7805 54.8223 3.7255 41.3230 13.5286 13.2936 50.6741 0.9708 12.0389 0.5027 14.2262 0.0295 4.8036 1.9386 17.1324 2.1092 14.8202 6.9062 14.4993 8.2906 18.3093 2.9465 0.0119 1.6897 28.1748 35.3791 19.9890 45.4381 0.3816 69.8920 0.0009 57.0684 101.6008 8.1544 122.9038 57.4738 21.8030 58.8608 414.2936 45.1434 1.7447 4.9178 9.3242 120.7084 6.9655 13.2515 1.7480 0.1267 8.2567 12.1259 28.9197 2.0823 1.1012 21.4122 9.0689 58.8849
temp: 298.150 k
press: 1.00000 atm
elementType: 17 8 7 6 6 6 6 6 6 6 6 6 6 6 6 6 6 1 1 1 1 1 1 1 1 1 1 1 1
symmnumber: 1
zpe: 581630.4 jmol-1
zpe.correction: 0.221531 hartree
zpe.thermalcorrener: 0.235300 hartree
zpe.thermalcorrenthalpy: 0.236244 hartree
zpe.thermalcorrgfe: 0.179806 hartree
zpe.sumelectzpe: -1129.558078 hartree
zpe.sumelectthermal: -1129.544309 hartree
zpe.sumelectthermalent: -1129.543365 hartree
zpe.sumelectthermalfe: -1129.599803 hartree
dipole: -5.1156 -2.2377 -0.0005
dipole: 5.5836
quadrupole: -99.4118 -116.2081 -102.2195
quadrupole: 4.2358 -0.0012 0.0024
quadrupole: 6.5347 -10.2616 3.7269 4.2358 -0.0012 0.0024
hfenergy: -1129.779609 hartree
pointgroup: C01 [X(C14H12Cl1N1O1)]
dipole: -2.11085 0.6083448 -0.0006146 debye
polarizability: 210.4962786|-20.9641623|194.3767414|0.0267627|0.0458039|110.784559 unknown
InChI: InChI=1S/C14H12ClNO/c1-10(17)16-14-8-7-12(15)9-13(14)11-5-3-2-4-6-11/h2-9,16H,1H3
charge 0 multiplicity 1
29 atoms
Cl 2.720879 -3.985898 -0.000833
O  2.442284 3.026557 0.002362
N  0.52714 1.662508 0.001019
C  0.177473 -0.749972 -0.000154
C  1.08691 0.356041 0.000631
C  -1.309897 -0.527267 -0.000534
C  0.690393 -2.067136 -0.000603
C  2.488351 0.121645 0.000971
C  -2.025976 -0.423276 1.222409
C  -2.025321 -0.423223 -1.223854
C  2.081939 -2.27501 -0.000258
C  2.985989 -1.198042 0.000526
C  -3.42645 -0.229059 1.221805
C  -3.425795 -0.229007 -1.22399
C  -4.129812 -0.131204 -0.001279
C  1.182649 2.89752 0.001818
C  0.229719 4.093407 0.001862
H  0.000355 -2.915587 -0.001204
H  3.168703 0.97485 0.001593
H  -1.482171 -0.507454 2.170208
H  -1.481004 -0.507335 -2.171364
H  -0.497453 1.68909 0.000663
H  4.065145 -1.376822 0.000793
H  -3.966282 -0.158968 2.172639
H  -3.965119 -0.158864 -2.175109
H  -5.215563 0.015315 -0.001567
H  -0.419243 4.087867 -0.893489
H  0.825705 5.016779 0.003371
H  -0.421348 4.086247 0.895669
