program: Gaussian 09
title: 000231514
version: EM64L-G09RevD.01
frameworkgroup: C1[X(C15H20O3)]
method: RPBEPBE
basis: SDD
operation: Freq
keyword: #pfreq=noraman
keyword: PBEPBE/SDD
title: #p freq=noraman PBEPBE/SDD
converged: YES YES NO NO
title: Mulliken charges:
elementType: O O O C C C C C C C C C C C C C C C H H H H H H H H H H H H H H H H H H H H
charge: -0.295673 -0.432134 -0.236250 -0.116557 -0.466826 0.120233 -0.441786 -0.448736 -0.545200 0.326347 -0.398931 0.181747 -0.411808 -0.494005 -0.388166 -0.249278 0.202617 -0.550074 0.216835 0.199033 0.205357 0.210776 0.206930 0.207200 0.245959 0.221415 0.222359 0.229121 0.201475 0.231261 0.270002 0.247924 0.237831 0.221165 0.221645 0.261615 0.217339 0.369239
chargesum: 0.00000
title: Mulliken charges with hydrogens summed into heavy atoms:
elementType: O O O C C C C C C C C C C C C C C C
charge: -0.295673 -0.062895 -0.236250 0.100279 -0.062437 0.120233 -0.024080 0.004423 -0.101426 0.326347 0.031664 0.181747 -0.180547 0.023922 -0.150335 -0.028113 0.202617 0.150525
polarizability: 1.95399727e+02 7.85195955e+00 1.85031878e+02 -1.17711318e+01 3.79708027e+00 1.17551625e+02
1716.lowfreq: -9.3347 -3.9818 -0.0010 0.0002 0.0004 9.1057 36.1215 37.8012 61.4571
frequency: 36.1040 37.7362 61.4239 65.5986 87.2342 102.9532 121.6417 169.9317 189.9630 197.4642 207.2199 256.2748 273.0987 292.4408 315.0642 342.8385 359.6150 375.5498 448.1308 459.1233 466.3853 494.3169 498.5466 529.2128 536.1773 574.1196 578.5531 623.3078 644.0816 680.0822 727.5844 745.3329 772.9416 804.5120 815.8129 837.4665 856.7248 869.7183 877.8308 890.2000 914.4460 954.8998 960.4838 976.7565 1010.6893 1030.2849 1042.5847 1052.7189 1079.2507 1094.6963 1102.7799 1109.7464 1113.9359 1144.6862 1157.3857 1161.8789 1181.0134 1188.3430 1193.3204 1210.6670 1221.3630 1236.4594 1249.5760 1252.2827 1270.2808 1294.1221 1317.3508 1335.2139 1336.9784 1343.3570 1349.0708 1354.3714 1371.2472 1388.0050 1432.7500 1435.4862 1448.8481 1455.0944 1457.5648 1466.7909 1469.6797 1470.1976 1473.5148 1478.3701 1481.2023 1591.7338 1605.5750 1671.3663 2955.1878 2956.7290 2969.5941 2982.1422 2985.5646 2988.7448 2994.4211 2999.3397 3018.2699 3031.5329 3044.7546 3045.6998 3047.2962 3059.5212 3068.1663 3116.8684 3121.7234 3141.4654 3166.2332 3503.7383
redmass: 6.4762 6.2774 3.7766 6.7990 4.0605 3.3226 2.6257 3.2615 3.5310 3.0483 2.2868 2.4583 1.4436 2.1302 3.2020 2.9888 2.5526 2.3667 3.5518 3.0111 3.4002 2.9403 2.2106 3.4975 4.0818 4.2839 3.8481 2.7390 1.3749 3.5739 3.0088 1.9776 1.7077 3.7256 2.7306 2.0356 2.1871 1.6758 2.1131 2.3234 2.1834 2.4216 1.3207 2.5773 2.0189 2.3550 2.3748 3.7276 2.4323 1.9011 2.4153 1.7047 1.2694 1.1887 1.3635 1.4230 1.3749 1.3069 1.2207 1.5455 1.8333 3.0159 1.2899 1.6282 1.2320 1.3385 1.5160 1.4260 1.5188 1.4056 1.4255 1.5668 1.6463 5.9469 1.2999 1.0930 1.3445 1.7927 1.0954 1.3614 1.0825 1.0992 1.2938 1.0894 1.2070 6.7955 6.9996 7.9199 1.0643 1.0327 1.0687 1.0643 1.0653 1.0680 1.0659 1.0655 1.0940 1.0983 1.1038 1.1001 1.1015 1.0992 1.0940 1.0869 1.1001 1.0923 1.0961 1.0637
irintensity: 0.8649 0.3155 0.3220 0.3272 0.1205 6.9252 0.5379 1.2118 0.8561 2.7667 1.0548 0.8289 2.8779 1.4124 2.4524 4.4346 0.6362 4.0319 1.9724 18.3516 1.1623 18.3840 21.1023 0.5785 2.8223 2.2810 7.3325 1.6902 161.8060 11.3905 12.9905 7.3682 53.6376 0.7182 2.7856 10.7357 22.0391 3.0120 0.1926 16.8664 6.3768 7.7963 0.3377 13.1656 50.4616 12.0657 167.8575 57.9364 25.9037 4.5970 10.7200 20.3758 1.0587 0.3466 2.5977 10.0659 1.8997 8.0658 2.8619 8.3080 16.7328 88.1688 4.1758 9.9160 2.5503 0.8768 6.2939 2.9870 2.5158 2.9329 2.7354 0.2092 37.9687 2.2110 20.3619 39.1700 1.6779 64.3977 16.6084 23.1579 7.6163 7.6246 15.1391 12.9860 7.1616 44.1677 14.8691 184.1529 32.5671 64.4968 15.5948 20.5561 11.1583 33.0974 68.3708 19.9455 35.9630 53.6725 36.2912 14.3116 87.4327 26.7018 12.0890 7.1016 9.2980 26.5584 20.2038 16.7723
temp: 298.150 k
press: 1.00000 atm
elementType: 8 8 8 6 6 6 6 6 6 6 6 6 6 6 6 6 6 6 1 1 1 1 1 1 1 1 1 1 1 1 1 1 1 1 1 1 1 1
symmnumber: 1
zpe: 839525.6 jmol-1
zpe.correction: 0.319758 hartree
zpe.thermalcorrener: 0.337142 hartree
zpe.thermalcorrenthalpy: 0.338086 hartree
zpe.thermalcorrgfe: 0.274098 hartree
zpe.sumelectzpe: -807.908836 hartree
zpe.sumelectthermal: -807.891453 hartree
zpe.sumelectthermalent: -807.890509 hartree
zpe.sumelectthermalfe: -807.954497 hartree
dipole: 0.0084 1.1298 -1.5240
dipole: 1.8971
quadrupole: -102.1637 -93.8207 -114.6139
quadrupole: 7.2242 -5.8521 3.2655
quadrupole: 1.3691 9.7121 -11.0811 7.2242 -5.8521 3.2655
hfenergy: -808.2285945 hartree
pointgroup: C01 [X(C15H20O3)]
dipole: 0.0520791 -0.3627227 -0.6502252 debye
polarizability: 192.8631688|8.3913371|188.4272893|7.8191293|6.4861449|116.692772 unknown
InChI: InChI=1S/C15H20O3/c1-18-13-9-3-7-11-5-2-6-12(15(11)13)8-4-10-14(16)17/h3,7,9,12,16H,2,4-6,8,10H2,1H3
charge 0 multiplicity 1
38 atoms
O  -0.392556 -1.450514 -0.81437
O  -3.987551 -1.749268 -0.271343
O  -3.708735 -0.597619 1.720463
C  0.044534 1.261219 -0.502746
C  0.566132 2.702728 -0.742125
C  1.197836 0.271771 -0.326033
C  1.669588 3.081528 0.269555
C  -0.948903 1.20681 0.707378
C  2.890615 2.156666 0.093492
C  2.521656 0.679118 -0.015986
C  -2.394238 1.621307 0.332675
C  0.939904 -1.125291 -0.479897
C  3.540774 -0.295941 0.158289
C  -3.157254 0.516056 -0.431244
C  1.953726 -2.094162 -0.315789
C  3.261352 -1.666296 0.011988
C  -3.614838 -0.609497 0.474242
C  -0.720886 -2.861229 -1.033482
H  -0.521952 0.939287 -1.399804
H  -0.277847 3.416883 -0.677319
H  0.978825 2.784833 -1.768083
H  1.277502 2.992332 1.301574
H  1.97445 4.136251 0.13233
H  -0.571411 1.86914 1.510535
H  -0.96894 0.187894 1.13312
H  3.607471 2.297217 0.925487
H  3.432522 2.450382 -0.830568
H  -2.958248 1.869309 1.251107
H  -2.373599 2.536666 -0.291069
H  4.557231 0.032677 0.406809
H  -2.541713 0.078937 -1.236723
H  -4.067032 0.924652 -0.916187
H  1.744456 -3.160777 -0.437866
H  4.054544 -2.409822 0.149013
H  -0.140607 -3.280294 -1.878479
H  -1.795556 -2.866071 -1.268793
H  -0.534221 -3.463162 -0.122583
H  -4.33283 -2.438523 0.359932
