program: Gaussian 09
title: 000231502
version: EM64L-G09RevD.01
frameworkgroup: C1[X(C10H11N)]
method: RPBEPBE
basis: SDD
operation: Freq
keyword: #pfreq=noraman
keyword: PBEPBE/SDD
title: #p freq=noraman PBEPBE/SDD
converged: NO YES NO NO
title: Mulliken charges:
elementType: N C C C C C C C C C C H H H H H H H H H H H
charge: -0.029746 -0.564919 0.403655 0.155831 -0.488815 0.029481 -0.429379 -0.364350 -0.773819 -0.224466 -0.255950 0.230805 0.220457 0.230123 0.220523 0.237399 0.239961 0.219310 0.258238 0.227721 0.229282 0.228659
chargesum: 0.00000
title: Mulliken charges with hydrogens summed into heavy atoms:
elementType: N C C C C C C C C C C
charge: -0.029746 -0.113656 0.403655 0.155831 -0.038170 0.029481 -0.191980 -0.124389 -0.068551 0.004816 -0.027291
polarizability: 1.43141140e+02 -6.46071594e+00 1.24744393e+02 3.68603334e-01 -1.38285140e+00 6.03506158e+01
1716.lowfreq: -9.4694 -0.0009 -0.0007 -0.0004 8.0778 16.3884 100.7413 131.5442 189.6817
frequency: 100.7290 131.5292 189.6760 228.8889 270.7194 291.2784 398.2865 414.1170 440.6790 470.8078 482.8898 558.5847 608.1116 639.3704 697.7810 742.8365 773.3505 784.5470 856.9740 877.9168 891.8241 951.9973 987.5873 991.0280 1023.4727 1032.6848 1049.0019 1066.7703 1075.2985 1139.2568 1167.9994 1176.0669 1210.5260 1226.3693 1281.2634 1293.3319 1311.1391 1355.2932 1381.9386 1385.0151 1439.0706 1447.0551 1452.8972 1460.1510 1467.1411 1480.9727 1569.7754 1606.2281 1611.4830 2956.8454 2966.2324 2977.7304 3043.8369 3050.0424 3055.6414 3118.5733 3121.5113 3131.9402 3146.6238 3163.2813
redmass: 2.9119 3.1958 1.1616 2.2836 3.2299 2.1961 3.4477 2.9736 3.4480 4.5875 4.6080 4.7083 3.0261 2.6251 4.5888 2.2787 1.6569 3.4632 3.2595 1.3404 2.0193 1.3873 2.1512 1.3391 1.9161 2.5816 1.7920 2.9583 2.3201 1.6311 1.1869 1.0635 1.9663 1.4226 1.3503 4.0842 1.4442 1.4509 2.2839 1.9605 2.0648 1.1872 1.1212 1.0650 1.0581 2.5538 5.7041 6.9601 6.5963 1.0699 1.0627 1.0385 1.0946 1.0955 1.0964 1.0870 1.0980 1.0883 1.0935 1.1002
irintensity: 0.2255 0.5905 2.6871 5.4553 1.2433 6.3210 2.5654 0.3951 0.6139 4.7249 4.3976 1.6890 5.6478 11.4876 3.7188 20.6842 52.9903 7.5676 4.3826 0.1893 7.0102 1.9738 4.0344 0.1224 5.3486 7.1399 2.7768 1.4936 3.5057 4.1261 0.4206 0.9410 3.2409 6.1100 2.1322 63.2819 5.6805 4.3300 14.1756 20.7134 2.1608 18.9125 7.2191 8.7453 19.4354 5.4768 19.2745 27.2433 13.5171 33.9541 35.4398 16.7735 36.8383 41.1333 20.7528 6.3552 14.1270 6.0945 28.7366 26.9959
temp: 298.150 k
press: 1.00000 atm
elementType: 7 6 6 6 6 6 6 6 6 6 6 1 1 1 1 1 1 1 1 1 1 1
symmnumber: 1
zpe: 479845.9 jmol-1
zpe.correction: 0.182764 hartree
zpe.thermalcorrener: 0.191856 hartree
zpe.thermalcorrenthalpy: 0.192800 hartree
zpe.thermalcorrgfe: 0.148900 hartree
zpe.sumelectzpe: -441.621009 hartree
zpe.sumelectthermal: -441.611917 hartree
zpe.sumelectthermalent: -441.610972 hartree
zpe.sumelectthermalfe: -441.654872 hartree
dipole: -2.1711 -0.3682 0.1330
dipole: 2.2061
quadrupole: -68.1357 -55.6599 -67.8571
quadrupole: -0.7304 0.8192 -0.3290
quadrupole: -4.2515 8.2243 -3.9729 -0.7304 0.8192 -0.3290
hfenergy: -441.8037723 hartree
pointgroup: C01 [X(C10H11N1)]
dipole: -0.851849 -0.1598539 0.0461665 debye
dipolederiv: -0.6604287 0.1810159 0.0863879 -0.0027981 -0.4341916 0.0241046 -0.1147482 0.0304954 -0.3309979 -0.1190038 0.0382145 0.0392912 0.066535 -0.018741 0.0199135 0.0294555 0.0410942 0.0990876 0.0732024 -0.1654239 0.0725856 -0.1188573 0.0903008 -0.0460913 0.1288092 -0.0675125 -0.0228373 -0.2305595 -0.072856 0.0040722 -0.0336807 -0.2145451 -0.0163934 -0.0141071 -0.0094534 0.0206479 0.2541685 -0.106499 -0.0281294 -0.1385007 0.2637166 -0.0026796 -0.0138613 -0.0295991 0.2614705 0.7052758 0.0560128 -0.0348034 0.1910998 0.5895185 0.1003908 0.1123287 0.0520232 0.0150102 -0.1518397 0.1424388 -0.0208384 0.0926071 0.076996 -0.0296668 -0.0499229 -0.0131624 -0.1619433 0.0309403 0.0743275 0.0065082 -0.0047814 0.0742439 -0.0097232 -0.0350627 -0.0196206 -0.1389728 -0.0645293 -0.0522021 -0.0030575 -0.1067375 -0.2713647 -0.0485184 -0.02115 -0.0304189 0.063006 0.0715773 0.0267686 0.021554 0.0608484 0.0189579 -0.0161924 0.0053596 -0.0080172 -0.1400811 -0.0424319 -0.1098863 0.0199637 -0.171732 -0.0169914 -0.0181949 0.0225774 -0.0215504 -0.1713586 0.0249699 0.0669346 -0.052122 0.0369733 0.0689374 -0.0028761 -0.0391744 0.0538809 -0.1280863 0.0315524 -0.1272937 -0.0201912 -0.0276936 -0.1454624 -0.0409592 0.0013824 -0.061476 0.0837854 -0.0962302 0.126874 -0.0199128 0.1118491 -0.0548561 0.0114749 -0.0491969 0.0671985 0.0836519 0.1295827 -0.0849923 -0.0490547 0.0236765 -0.0091907 -0.0033322 0.0355118 -0.0593473 -0.1560255 0.0690882 -0.0214122 -0.0000845 -0.0702323 -0.1116922 0.0234814 0.0032868 0.0206637 0.146123 0.0946733 -0.0620093 0.0065923 -0.0426701 -0.0880383 0.0177011 0.0102846 0.0197868 0.1418488 0.0862234 0.0636589 -0.0839326 0.0323535 -0.0196606 0.0667985 -0.0586972 0.102873 -0.0276589 -0.1089351 -0.0670952 -0.01883 0.0227744 0.11474 -0.001603 -0.0056812 -0.0052991 0.110707 0.0650153 0.0387287 0.1017131 0.0171589 0.0313323 -0.0540949 0.0747464 -0.08724 -0.06118 -0.1254065 -0.0477651 -0.0104644 -0.0558332 0.076104 0.0041963 -0.0062226 0.0014944 0.1568342 -0.0369047 0.1024607 -0.0172474 0.1176409 -0.0201133 0.0222644 -0.0159178 0.0231867 0.1569694 unknown
polarizability: 143.3508176|-6.1352483|124.5402941|0.8744658|-1.0599756|60.3450366 unknown
InChI: InChI=1S/C10H11N/c1-8-10-5-3-2-4-9(10)6-7-11-8/h2-5H,6-7H2,1H3
charge 0 multiplicity 1
22 atoms
N  2.38668 -0.099966 -0.143892
C  0.697277 -1.942285 0.347543
C  -0.408682 -0.921487 0.132005
C  -0.025835 0.450686 0.018154
C  1.975242 -1.50944 -0.403757
C  1.4331 0.78925 0.04367
C  -1.775692 -1.269083 0.090181
C  -1.030972 1.442988 -0.12248
C  1.859728 2.227865 0.27271
C  -2.770039 -0.274078 -0.060085
C  -2.396152 1.085785 -0.163613
H  0.923674 -2.001526 1.432955
H  0.379981 -2.951385 0.026648
H  2.82559 -2.158807 -0.131041
H  1.827164 -1.614898 -1.500465
H  -2.065682 -2.323445 0.177406
H  -0.747217 2.497324 -0.207011
H  1.523967 2.882014 -0.555199
H  2.95802 2.266708 0.32569
H  1.430632 2.635031 1.207371
H  -3.827936 -0.557782 -0.094248
H  -3.163347 1.859932 -0.275341
