program: Gaussian 09
title: 000231538
version: EM64L-G09RevD.01
frameworkgroup: C1[X(C28H26O4)]
method: RPBEPBE
basis: SDD
operation: Freq
keyword: #pfreq=noraman
keyword: PBEPBE/SDD
title: #p freq=noraman PBEPBE/SDD
converged: YES YES NO NO
title: Mulliken charges:
elementType: O O O O C C C C C C C C C C C C C C C C C C C C C C C C C C C C H H H H H H H H H H H H H H H H H H H H H H H H H H
charge: -0.468100 -0.458096 -0.267867 -0.267759 -0.077818 -0.010613 0.394428 0.402160 0.280512 0.421492 -0.361469 -0.296481 -0.378696 -0.426936 -0.416526 -0.395711 -0.405758 -0.374190 -0.360401 -0.390038 -0.394481 -0.375207 -0.243659 -0.252202 -0.235298 -0.263278 0.314925 0.320662 -0.235842 -0.244419 -0.538086 -0.538032 0.359496 0.350021 0.267459 0.263361 0.288236 0.231651 0.282001 0.199605 0.295476 0.310702 0.244163 0.246625 0.235515 0.235811 0.230123 0.222924 0.230631 0.227645 0.230886 0.226655 0.219655 0.219666 0.242159 0.217571 0.243344 0.221403
chargesum: 0.00000
title: Mulliken charges with hydrogens summed into heavy atoms:
elementType: O O O O C C C C C C C C C C C C C C C C C C C C C C C C C C C C
charge: -0.108604 -0.108074 -0.267867 -0.267759 -0.077818 -0.010613 0.394428 0.402160 0.280512 0.421492 -0.094011 -0.033121 -0.090460 -0.195285 -0.134525 -0.196106 -0.110282 -0.063488 -0.116238 -0.143413 -0.158966 -0.139397 -0.013536 -0.029278 -0.004667 -0.035632 0.314925 0.320662 -0.004955 -0.017764 0.143394 0.144286
polarizability: 3.94676515e+02 -5.47524025e-01 3.09855774e+02 2.11541011e+00 9.18434179e+00 2.43389469e+02
1716.lowfreq: -26.1438 -5.0950 -0.0011 -0.0007 -0.0006 2.1525 5.8439 25.5629 37.3681
frequency: -25.6600 25.4764 37.3139 38.7832 46.5105 51.7821 59.3056 64.2509 75.4236 94.2797 99.5154 124.7349 143.6880 163.5853 177.0610 178.1557 201.8722 216.4487 221.5694 233.1982 237.8669 242.0304 264.3574 280.5604 296.5293 304.3090 323.1389 338.1940 350.4865 357.5177 375.2229 399.6418 406.4929 412.7636 413.3520 429.6279 446.6897 454.4116 463.1220 496.9347 511.1992 528.2492 540.7623 557.4800 577.9227 596.4096 614.9492 616.8333 626.8492 633.1411 634.0456 656.8680 700.1182 710.4894 718.5061 726.4683 747.5475 761.3380 762.9943 773.5858 803.6905 815.5005 820.0435 830.3342 838.8638 846.0144 854.6812 865.3922 911.1734 924.6840 935.3373 946.5093 951.6000 958.5296 968.5992 973.0775 977.4035 979.5566 985.8258 988.3886 989.9504 990.2180 991.2964 995.8845 998.9960 1003.8502 1008.0117 1012.3680 1030.0085 1034.9350 1086.6090 1092.5112 1112.4508 1112.6373 1116.2073 1125.7783 1154.2149 1156.9592 1158.2834 1160.5759 1170.9289 1172.8672 1175.2051 1183.4948 1187.8457 1192.7302 1203.5056 1208.5106 1228.8303 1233.0107 1261.1972 1301.1504 1309.7303 1314.3481 1319.7038 1328.6381 1369.3417 1373.5069 1377.1998 1377.7789 1413.2138 1418.0246 1432.1225 1433.4833 1435.2894 1436.6571 1464.8874 1465.7284 1472.9646 1473.7575 1475.7748 1484.9324 1496.3167 1500.1279 1580.1903 1583.1395 1585.1562 1588.8234 1604.7747 1610.9839 1618.3913 1622.3082 2955.5884 2956.3699 3041.9292 3042.8070 3107.9326 3120.1824 3121.6934 3125.6963 3126.0680 3135.0639 3139.1701 3143.5899 3147.2599 3148.0825 3152.6385 3154.6224 3157.0289 3158.4882 3165.2271 3167.4557 3167.9860 3175.4440 3181.1477 3185.4980 3495.1597 3563.6041
redmass: 3.7159 4.7909 4.9024 4.4405 3.6834 4.2162 4.1441 4.6702 4.2920 3.6551 3.6278 5.0758 4.6375 4.3891 3.7444 3.9740 1.8252 3.9561 4.1331 1.2348 1.7211 1.9652 3.8210 5.0157 3.8437 4.5685 5.2457 5.7800 4.5439 4.8515 5.3382 2.7498 2.4368 2.9310 2.9926 4.0467 1.3393 3.5801 4.1623 3.8310 3.2284 3.1011 4.0700 3.9706 4.4060 5.6088 6.3830 6.3577 6.3818 7.0749 6.8806 4.9457 1.6628 2.2268 2.9845 3.8247 2.6651 4.6127 1.9742 3.7321 1.6064 1.8940 1.3698 1.5857 2.1905 1.3440 3.1508 1.2571 1.6094 1.6494 1.7329 2.1238 2.2463 1.4416 2.1577 1.4344 2.9878 1.5138 2.1977 5.7409 7.6279 6.0087 2.4528 1.9149 1.7573 1.7346 2.5323 2.8564 2.2237 2.1859 1.6227 1.6181 1.2612 1.2608 1.3467 1.3686 1.9924 1.3540 1.4127 2.9751 2.4682 1.0555 1.0976 1.4253 1.4091 1.1412 1.6802 1.9087 2.8477 2.6677 1.4339 1.3490 1.2810 1.6295 1.3640 1.3853 5.3635 5.9651 6.4377 8.2363 4.0516 3.6374 2.2115 2.2342 1.1698 1.1679 1.0503 1.0502 1.0851 1.0760 2.1373 2.1210 2.2730 2.3743 7.2911 7.2313 6.0711 5.8723 5.9560 5.9175 6.3371 6.3339 1.0330 1.0330 1.1037 1.1037 1.0867 1.0992 1.0992 1.0848 1.0867 1.0883 1.0932 1.0864 1.0928 1.0875 1.0880 1.0894 1.0956 1.0993 1.0947 1.1006 1.0951 1.0966 1.0948 1.0949 1.0651 1.0658
irintensity: 3.0325 0.4088 2.5902 0.6959 0.5314 1.1071 0.2484 0.2981 0.2415 2.6231 3.2414 1.1517 5.4225 4.0648 0.7118 2.8175 89.7953 26.7802 14.9703 0.3370 3.5258 9.0892 6.1757 0.6254 8.8667 7.5105 11.7270 7.2031 4.2959 1.0924 4.2660 2.1338 27.9457 3.7101 0.9710 14.4645 160.3592 11.4407 10.1266 5.3613 2.1249 4.0117 23.8614 19.6591 31.6748 47.9834 0.3760 0.5970 10.5159 3.3740 0.2505 17.3036 64.9350 29.0372 13.4943 7.4996 39.5576 31.0469 44.2108 1.6084 24.8097 36.4007 27.6565 33.7716 43.3581 2.3552 15.6516 1.3701 7.5808 33.3252 2.0337 63.0524 2.8439 0.0924 22.2249 0.9751 4.7918 4.7567 2.1225 35.9144 11.9557 22.7914 4.9114 1.3291 3.3463 2.8707 25.1131 7.4863 8.2483 6.8958 1.8543 3.2269 0.2290 0.2461 3.0229 9.0750 26.5618 7.2710 2.5094 4.3071 100.2855 0.1280 2.1678 130.7347 37.5289 5.7255 5.3230 13.6379 174.9150 126.1626 36.2645 16.3418 9.4319 61.1273 6.2869 0.7947 8.0308 28.9865 3.0290 1.0799 3.0914 8.2915 10.7028 6.9238 12.0463 9.6313 12.0941 12.4264 89.1412 43.9088 19.0191 14.5702 138.4919 88.8378 19.7399 11.3712 1.5538 2.4693 2.4617 5.2710 80.4257 42.9852 85.3273 63.8858 47.2800 48.3451 14.0252 31.8009 30.6215 0.0253 1.7312 6.5656 31.9017 7.5665 14.2415 7.7425 4.8183 6.8484 17.7644 34.0414 16.5934 21.3010 8.9554 6.3649 7.6644 3.0858 26.3046 6.8361
temp: 298.150 k
press: 1.00000 atm
elementType: 8 8 8 8 6 6 6 6 6 6 6 6 6 6 6 6 6 6 6 6 6 6 6 6 6 6 6 6 6 6 6 6 1 1 1 1 1 1 1 1 1 1 1 1 1 1 1 1 1 1 1 1 1 1 1 1 1 1
symmnumber: 1
zpe: 1211645.0 jmol-1
zpe.correction: 0.461491 hartree
zpe.thermalcorrener: 0.489668 hartree
zpe.thermalcorrenthalpy: 0.490612 hartree
zpe.thermalcorrgfe: 0.403170 hartree
zpe.sumelectzpe: -1381.157410 hartree
zpe.sumelectthermal: -1381.129233 hartree
zpe.sumelectthermalent: -1381.128289 hartree
zpe.sumelectthermalfe: -1381.215731 hartree
dipole: 1.8036 2.5904 -0.9736
dipole: 3.3032
quadrupole: -155.6050 -179.5086 -178.3454
quadrupole: 1.3292 15.2240 1.7471
quadrupole: 15.5480 -8.3556 -7.1924 1.3292 15.2240 1.7471
hfenergy: -1381.6189011 hartree
pointgroup: C01[X(C28H26O4)]
dipole: -0.8291758 -0.9396566 -0.3441587 debye
polarizability: 393.2017818|-10.2676343|310.7308596|-7.3104799|-9.6723176|243.9891172 unknown
InChI: InChI=1S/C28H26O4/c1-31-25-17-13-23(14-18-25)28(30,24-15-19-26(32-2)20-16-24)27(29,21-9-5-3-6-10-21)22-11-7-4-8-12-22/h3-20,29-30H,1-2H3
charge 0 multiplicity 1
58 atoms
O  -0.089214 -0.354098 1.862332
O  -0.207163 -0.759357 -1.846332
O  4.801072 3.294603 0.250994
O  -4.324191 3.801048 -0.723497
C  -0.012465 0.094927 0.453872
C  -0.087657 -1.238698 -0.447024
C  1.310966 0.875089 0.342852
C  -1.18682 1.063578 0.152477
C  -1.373312 -2.023179 -0.081682
C  1.153537 -2.159083 -0.327388
C  1.738142 1.638523 1.462834
C  -1.24727 1.795268 -1.066464
C  2.074917 0.936097 -0.843485
C  -2.198091 1.293876 1.11079
C  -1.347638 -3.091374 0.854773
C  1.364134 -3.130053 -1.341905
C  -2.614341 -1.661448 -0.671403
C  2.063416 -2.121653 0.758664
C  2.899023 2.426815 1.402477
C  -2.299861 2.687345 -1.327412
C  3.243994 1.727446 -0.920453
C  -3.263022 2.193783 0.869002
C  -2.533686 -3.784002 1.189352
C  2.456094 -4.022314 -1.289175
C  -3.795963 -2.361426 -0.342941
C  3.159345 -3.012549 0.813635
C  3.658307 2.476132 0.206738
C  -3.31915 2.88745 -0.361783
C  -3.761733 -3.423915 0.589414
C  3.365407 -3.965419 -0.208061
C  5.614468 3.378064 -0.962464
C  -5.379865 4.060958 0.256507
H  -0.873252 -0.958824 1.951593
H  -0.531478 -1.50779 -2.407776
H  1.154971 1.597293 2.386839
H  -0.463573 1.66175 -1.814902
H  1.764122 0.353897 -1.715264
H  -2.151106 0.790697 2.08126
H  -0.394586 -3.398876 1.297916
H  0.671398 -3.209127 -2.189284
H  -2.647986 -0.821784 -1.372354
H  1.914033 -1.39893 1.563442
H  3.235432 3.013419 2.263028
H  -2.347766 3.249759 -2.265044
H  3.815585 1.744068 -1.853469
H  -4.022888 2.343771 1.641956
H  -2.494165 -4.609176 1.90921
H  2.594751 -4.759644 -2.088118
H  -4.744081 -2.070127 -0.808654
H  3.853421 -2.956864 1.659934
H  -4.679673 -3.965984 0.843052
H  4.216925 -4.653785 -0.163861
H  5.0350 3.795143 -1.809527
H  6.020082 2.386951 -1.246122
H  6.441506 4.057973 -0.709268
H  -5.948957 3.139882 0.491475
H  -6.044324 4.794686 -0.223383
H  -4.96667 4.487685 1.19148
